Sample details: 5c4dc9e4448796027c79bc6c72f00daa --

Hashes
MD5: 5c4dc9e4448796027c79bc6c72f00daa
SHA1: f93b857cad9d6a8a598558b2d2e56758966459fb
SHA256: e286da6786044bc094cb8ca701cf4b3c6058785226263d66e2383ea70505e460
SSDEEP: 49152:V7aKG0CFsktsntnKgS9J64OrsXktn/cIwFGEUf7jb9rjvT2M1m7Nz14jqSHPp3WM:V7a9FaQ6Prs05wGlf7nRyTTSvU
Details
File Type: ELF
Yara Hits
CuckooSandbox/embedded_pe | YRP/possible_includes_base64_packed_functions | YRP/with_images | YRP/without_attachments | YRP/with_urls | YRP/maldoc_getEIP_method_1 | YRP/domain | YRP/IP | YRP/url | YRP/contentis_base64 | YRP/Misc_Suspicious_Strings | YRP/android_meterpreter | YRP/CRC32_poly_Constant | YRP/CRC32_table | YRP/CRC32b_poly_Constant | YRP/MD5_Constants | YRP/RIPEMD160_Constants | YRP/SHA1_Constants | YRP/SHA512_Constants | YRP/WHIRLPOOL_Constants | YRP/BASE64_table | YRP/ldpreload | YRP/PM_Email_Sent_By_PHP_Script |
Source
http://rfksnrfrfhk.ga/php
http://rfksnrfrfhk.ga/php
Strings
		/lib/ld-linux.so.2
\(DAa%
.UJft0
6MH4~ 
A'bO'Y
szl-Xo
hdUov,
'g\>>M
(2twX|Y
hz++2;
Zxat-N
1<7u0d
W,N~o:q
libcrypt.so.1
__gmon_start__
_Jv_RegisterClasses
libreadline.so.5
rl_terminal_name
rl_mark
rl_readline_name
rl_on_new_line
rl_library_version
rl_done
rl_end
rl_completion_append_character
rl_callback_read_char
rl_completion_matches
rl_line_buffer
history_list
tilde_expand
rl_special_prefixes
rl_prompt
rl_callback_handler_remove
rl_point
rl_pending_input
rl_attempted_completion_function
rl_callback_handler_install
rl_redisplay
using_history
libncurses.so.5
libgmp.so.3
__gmpz_fdiv_qr_ui
__gmpz_invert
__gmpz_tdiv_q_ui
__gmpz_fdiv_r_ui
__gmpz_powm
__gmpz_setbit
__gmpz_sizeinbase
__gmpz_tdiv_qr
__gmpz_and
__gmpz_gcd_ui
__gmpz_tdiv_q
__gmpz_tdiv_r
__gmpn_perfect_square_p
__gmpz_nextprime
__gmpz_cdiv_q_ui
__gmpz_fdiv_qr
__gmpz_cdiv_qr_ui
__gmpz_jacobi
__gmpz_fdiv_q
__gmpz_fdiv_r
__gmpz_sqrtrem
__gmpz_get_str
__gmpz_fac_ui
__gmpz_cmp
__gmp_randclear
__gmpz_gcdext
__gmpz_fdiv_q_ui
__gmpz_probab_prime_p
__gmpz_ior
__gmp_randinit_lc_2exp_size
__gmp_set_memory_functions
__gmpz_clear
__gmpz_sub
__gmpz_cmp_si
__gmpn_popcount
__gmp_version
__gmpz_get_si
__gmpz_com
__gmpz_gcd
__gmpz_cdiv_qr
__gmpz_mul_ui
__gmp_randseed_ui
__gmpz_tdiv_r_ui
__gmpz_abs
__gmpz_add_ui
__gmpz_sqrt
__gmpz_init
__gmpz_mul
__gmpz_init_set_si
__gmpz_tdiv_qr_ui
__gmpz_pow_ui
__gmpz_ui_pow_ui
__gmpz_divexact
__gmpz_init_set_str
__gmpz_clrbit
__gmpz_scan0
__gmpz_scan1
__gmpz_urandomb
__gmpz_neg
__gmpz_sub_ui
__gmpz_cdiv_r_ui
__gmpz_add
__gmpz_hamdist
__gmpz_powm_ui
__gmpz_mod
__gmpz_cdiv_q
__gmpz_cdiv_r
libbz2.so.1
BZ2_bzwrite
BZ2_bzCompressInit
BZ2_bzDecompressEnd
BZ2_bzflush
BZ2_bzDecompress
BZ2_bzerror
BZ2_bzlibVersion
BZ2_bzBuffToBuffCompress
BZ2_bzopen
BZ2_bzCompress
BZ2_bzread
BZ2_bzCompressEnd
BZ2_bzdopen
BZ2_bzclose
BZ2_bzDecompressInit
libz.so.1
gzdopen
gzclose
inflateInit2_
uncompress
deflate
deflateInit2_
gzread
inflate
compress2
gzwrite
gzflush
inflateEnd
deflateEnd
zError
deflateInit_
gzseek
libpcre.so.0
pcre_study
pcre_version
pcre_free
pcre_info
pcre_exec
pcre_get_substring_list
pcre_compile
pcre_fullinfo
pcre_maketables
librt.so.1
libresolv.so.2
__dn_skipname
__res_search
__res_nmkquery
__res_nsend
__dn_expand
libm.so.6
libdl.so.2
dlopen
dlclose
dlerror
libnsl.so.1
libxml2.so.2
__xmlStructuredError
xmlParseChunk
xmlRemoveID
xmlNewNsProp
xmlXPathRegisterNs
xmlOutputBufferCreateFilename
xmlOutputBufferCreateFilenameDefault
xmlRelaxNGCleanupTypes
xmlStrcmp
xmlParserInputBufferCreateFilenameDefault
xmlGetNsList
xmlStrncmp
xmlParseURI
xmlXPathNewContext
xmlFreeNode
xmlSearchNsByHref
xmlFreeParserCtxt
xmlReadFile
xmlSetStructuredErrorFunc
xmlSetGenericErrorFunc
xmlStrncatNew
xmlGetPredefinedEntity
xmlStrlen
xmlXPathFreeObject
xmlAllocOutputBuffer
xmlURIUnescapeString
xmlCleanupParser
xmlGetDocEntity
xmlResetError
xmlNodeDumpOutput
xmlStrdup
xmlFreeProp
xmlSplitQName2
xmlNodeSetContentLen
xmlStrndup
xmlFreeDoc
xmlFreeURI
xmlCopyError
xmlMalloc
xmlOutputBufferClose
xmlResetLastError
xmlDocGetRootElement
xmlEncodeEntitiesReentrant
xmlCreatePushParserCtxt
xmlGetLastError
xmlFree
xmlOutputBufferFlush
xmlNewProp
xmlAllocParserInputBuffer
xmlNewTextChild
xmlNodeListGetString
xmlIsBlankNode
xmlXPathFreeContext
xmlXPathEval
xmlInitParser
xmlStrncat
xmlHasNsProp
xmlUnlinkNode
xmlFreeNs
xmlSaveFile
xmlDocCopyNode
xmlNewNs
xmlNewChild
xmlReadMemory
xmlDocDumpMemoryEnc
libgssapi_krb5.so.2
libkrb5.so.3
libk5crypto.so.3
libcom_err.so.2
libssl.so.6
BIO_free
sk_pop_free
BIO_ctrl
sk_free
PEM_read_bio_PrivateKey
sk_value
X509_STORE_new
X509_STORE_CTX_init
RSA_private_decrypt
RSA_public_encrypt
ASN1_INTEGER_set
BIO_new
X509_get_subject_name
ERR_clear_error
PEM_read_bio_X509
BIO_puts
sk_shift
X509_verify_cert
EVP_PKEY_bits
EVP_PKEY_size
X509_verify_cert_error_string
EVP_MD_CTX_cleanup
X509_check_purpose
EVP_rc4
ASN1_INTEGER_get
sk_num
d2i_X509
EVP_PKEY_free
ERR_peek_error
BIO_write
EVP_rc2_cbc
X509_get_pubkey
BIO_printf
EVP_get_digestbyname
EVP_dss1
EVP_des_cbc
EVP_DecryptUpdate
X509_check_private_key
EVP_SignFinal
X509_STORE_free
X509_free
sk_new_null
EVP_PKEY_new
EVP_EncryptUpdate
X509_get_issuer_name
EVP_PKEY_copy_parameters
EVP_VerifyFinal
EVP_PKEY_assign
ERR_load_crypto_strings
EVP_des_ede3_cbc
EVP_md5
EVP_sha1
sk_push
OBJ_obj2nid
EVP_DigestUpdate
SSL_get_verify_result
TLSv1_server_method
SSL_write
SSL_CTX_set_default_passwd_cb
SSL_set_shutdown
SSL_set_connect_state
SSLv2_server_method
SSL_shutdown
SSL_get_certificate
SSL_CTX_use_certificate_chain_file
SSL_CTX_new
SSL_accept
SSL_set_fd
SSLv23_client_method
SSL_read
SSL_get_privatekey
SSL_copy_session_id
SSL_set_ex_data
SSL_CTX_check_private_key
SSLv3_server_method
SSLv2_client_method
SSL_get_error
SSL_get_peer_certificate
SSL_pending
TLSv1_client_method
SSL_peek
SSL_connect
SSL_library_init
SSL_set_accept_state
SSL_get_ex_new_index
SSL_CTX_free
SSL_CTX_set_default_passwd_cb_userdata
SSL_CTX_ctrl
SSL_CTX_use_PrivateKey_file
SSL_CTX_set_cipher_list
SSL_get_ex_data
SSLv23_server_method
SSL_get_peer_cert_chain
SSL_CTX_set_verify
SSL_new
SSL_CTX_load_verify_locations
SSL_CTX_set_verify_depth
SSLv3_client_method
SSL_free
SSL_get_ex_data_X509_STORE_CTX_idx
libcrypto.so.6
X509V3_EXT_add_conf
X509_gmtime_adj
X509_NAME_get_text_by_NID
X509_NAME_get_entry
PKCS12_free
X509_REQ_get_attr_by_NID
RSA_private_encrypt
EVP_EncryptInit
EVP_rc2_40_cbc
X509_set_subject_name
EVP_OpenFinal
X509_REQ_add1_attr_by_txt
X509_NAME_get_index_by_NID
EVP_SealFinal
X509_dup
sk_pop
PEM_write_bio_PUBKEY
OBJ_nid2ln
OBJ_txt2nid
PEM_read_bio_X509_REQ
RAND_write_file
OBJ_obj2txt
X509_STORE_CTX_get_error_depth
X509_NAME_ENTRY_get_data
PKCS7_encrypt
ERR_load_ERR_strings
X509_set_version
X509_new
ASN1_STRING_set_default_mask_asc
X509_LOOKUP_hash_dir
X509_REQ_print
ASN1_STRING_data
X509_REQ_verify
EVP_cleanup
RAND_status
X509_print
OBJ_nid2sn
X509_NAME_add_entry_by_txt
DSA_get_default_method
X509_STORE_CTX_get_error
CONF_get_string
CONF_free
RSA_public_decrypt
X509V3_EXT_REQ_add_conf
X509V3_set_ctx
OPENSSL_add_all_algorithms_noconf
PKCS12_create
PEM_write_bio_PrivateKey
EVP_OpenInit
X509_REQ_sign
d2i_PKCS12_bio
PEM_ASN1_read_bio
X509V3_EXT_get
X509_NAME_add_entry_by_NID
X509_subject_name_hash
X509_STORE_CTX_free
X509_get_ext_count
X509_REQ_get_pubkey
ERR_error_string_n
X509_STORE_CTX_set_error
RAND_load_file
ASN1_item_d2i
RAND_egd
SMIME_write_PKCS7
PEM_X509_INFO_read_bio
ERR_error_string
GENERAL_NAME_print
X509_PURPOSE_get_id
ERR_get_error
X509_REQ_set_version
PKCS12_parse
X509_REQ_free
X509_REQ_set_pubkey
X509_LOOKUP_file
RAND_file_name
PKCS7_decrypt
X509_NAME_get_index_by_OBJ
ERR_load_EVP_strings
X509_STORE_CTX_set_purpose
PEM_write_bio_X509
ASN1_STRING_length
X509_EXTENSION_get_object
X509_set_issuer_name
X509_PURPOSE_get0_sname
OBJ_create_objects
X509_alias_get0
X509_REQ_new
GENERAL_NAME_free
X509_get_ext
X509_NAME_entry_count
OBJ_create
CONF_load
X509_NAME_ENTRY_get_object
CONF_get_section
PEM_write_bio_X509_REQ
X509_get_default_cert_area
X509V3_EXT_print
X509_get_serialNumber
PKCS7_get0_signers
EVP_DigestInit
EVP_rc2_64_cbc
PKCS7_sign
X509_PURPOSE_get0_name
EVP_md4
BIO_new_file
X509_set_pubkey
DSA_free
X509_STORE_CTX_get_current_cert
DSA_generate_key
X509_PURPOSE_get0
X509_sign
RSA_generate_key
i2s_ASN1_INTEGER
X509_STORE_add_lookup
BIO_s_mem
OpenSSL_add_all_digests
X509_STORE_CTX_get_ex_data
CONF_get_number
X509_PURPOSE_get_count
DSA_generate_parameters
X509_INFO_free
PEM_read_bio_PUBKEY
X509_LOOKUP_ctrl
X509V3_set_conf_lhash
X509_STORE_CTX_new
ASN1_STRING_type
X509_EXTENSION_get_data
PKCS7_free
PKCS7_verify
BIO_new_mem_buf
EVP_PKEY_type
SMIME_read_PKCS7
i2d_PKCS12_bio
OpenSSL_add_all_ciphers
DSA_set_method
ASN1_STRING_to_UTF8
EVP_SealInit
libc.so.6
_IO_stdin_used
strcpy
shmget
gmtime_r
__printf_chk
gai_strerror
inet_aton
optind
__strdup
__res_ninit
perror
__isnan
in6addr_any
getpwuid
inet_ntoa
fopencookie
__isinf
__read_chk
strncpy
__res_nclose
__vsprintf_chk
sigprocmask
readdir_r
__lxstat
shmctl
putchar
socketpair
memchr
getpid
mkstemp
statvfs
localtime_r
strtol
isatty
execle
getpwnam
asctime_r
setitimer
sigemptyset
getaddrinfo
memset
__errno_location
getsockopt
unsetenv
longjmp
_setjmp
__fprintf_chk
sigaddset
getgrnam
stdout
__strtoll_internal
strnlen
memcpy
__strtol_internal
strtoul
setsockopt
strfmon
strcat
__ctype_b_loc
optarg
stderr
munmap
__snprintf_chk
getgroups
mremap
execve
__fxstat
strncat
__realpath_chk
fileno
gnu_get_libc_version
iconv_close
sigaction
__memcpy_chk
srandom
strchr
__strtok_r
fdopen
iconv_open
__strtod_internal
hstrerror
__ctype_toupper_loc
__strcpy_chk
__ctype_tolower_loc
freeaddrinfo
setvbuf
__sprintf_chk
__h_errno_location
__xstat
memmove
pwrite
_IO_getc
opterr
__libc_start_main
stpcpy
globfree
__strtoul_internal
__environ
__stack_chk_fail
_edata
__bss_start
convert_to_long
_zend_hash_index_update_or_next_insert
php_write
zend_locale_sprintf_double
init_op_array
php_output_register_constants
php_stream_xport_get_name
zif_pcntl_wifstopped
zif_sys_get_temp_dir
add_char_to_string
sapi_register_post_entries
php_stream_unix_socket_ops
zim_reflection_property_isPrivate
execute_new_code
_php_stream_get_url_stream_wrappers_hash
zif_xml_error_string
pcntl_module_entry
zend_hash_set_apply_protection
_zend_ts_hash_init
php_if_stat
zend_do_declare_stmt
php_var_unserialize
filter_module_entry
zim_reflection_parameter_isPassedByReference
_zval_copy_ctor_func
zim_spl_SplFileInfo_getFilename
php_checkuid_ex
_php_stream_mmap_unmap_ex
zend_objects_store_call_destructors
php_hash_fetch_ops
zif_str_split
zend_objects_clone_members
zif_easter_days
zim_exception_getTraceAsString
php_pcre_replace_impl
zif_parse_str
php_stripcslashes
zim_reflection_property_isProtected
php_network_connect_socket
PHP_MD2Update
zif_stripos
php_ub_body_write_no_header
zend_do_include_or_eval
zend_ce_traversable
zend_ini_add_string
zend_shutdown_extensions
php_stream_bucket_prepend
zif_fprintf
zif_strtr
zim_reflection_function_getFileName
zim_reflection_function_getDocComment
cfg_get_string
zend_hash_get_current_key_type_ex
add_property_string_ex
php_replace_controlchars
zif_zend_logo_guid
zif_xml_parser_free
zif_umask
zif_user_sprintf
zif_fgetss
zif_octdec
zif_array_intersect_assoc
spl_filesystem_tree_get_iterator
zif_ftp_cdup
zend_hash_get_current_data_ex
zif_end
zend_file_handle_dtor
zend_cleanup_class_data
zif_stream_set_blocking
zend_declare_property_string
php_getuid
zif_image_type_to_mime_type
zif_filesize
PHP_WHIRLPOOLFinal
_zend_hash_add_or_update
convert_to_long_base
zim_reflection_class_isIterateable
php_stream_filter_create
zif_strcspn
zend_mm_startup_ex
zim_spl_SplFileInfo_getLinkTarget
zend_do_qm_true
zif_array_uintersect
zif_php_uname
zm_startup_filter
zif_gmp_add
zend_init_buffer
zend_dtoa
_zend_hash_init_ex
zend_restore_compiled_filename
OnUpdateString
zif_dns_get_record
zif_ltrim
php_stream_rfc2397_ops
init_executor
zif_is_array
php_on_timeout
pcntl_globals
zend_do_init_string
zim_spl_RecursiveDirectoryIterator_current
data_available
ps_srlzr_decode_php_binary
zend_throw_exception_object
zend_ts_hash_apply_with_arguments
zm_startup_crypt
zend_opcode_handlers
_object_and_properties_init
FrenchToSdn
zif_ftp_set_option
spl_ce_RuntimeException
zim_reflection_method_getPrototype
zif_urldecode
fetch_simple_variable_ex
php_statpage
zim_reflection_extension___construct
php_date_parse_tzfile_wrapper
zend_do_begin_class_declaration
zif_call_user_func
zend_ini_open_file_for_scanning
zim_reflection_function___toString
zend_stream_getc
zif_sha1_file
zend_print_zval_r
zim_spl_CachingIterator_valid
zif_localeconv
zend_set_timeout
spl_ce_OutOfBoundsException
php_std_post_handler
_zend_list_delete
timelib_strtotime
GregorianToSdn
MonthNameLong
zif_vsprintf
zif_strtotime
zm_info_openssl
zm_startup_spl_array
var_replace
module_registry_cleanup
zm_startup_gmp
zif_fread
zif_uasort
spl_SplOjectStorage_free_storage
zif_count
PHP_MD5Init
zif_urlencode
zif_array_diff
zend_do_fetch_class
zend_do_throw
calendar_functions
zim_reflection_class_isInstantiable
expand_filepath
zif_class_implements
boolean_not_function
php_handle_special_queries
php_shutdown_stream_hashes
php_stream_memory_ops
zif_array_slice
_php_stream_seek
PHP_CRC32BFinal
zim_spl_RegexIterator_setPregFlags
zif_highlight_file
zim_reflection_function_getNumberOfRequiredParameters
zif_highlight_string
php_module_shutdown
zend_stack_base
display_link_numbers
php_url_scanner_reset_vars
php_stream_gzip_wrapper
calendar_module_entry
zif_gmp_sqrt
zif_gettimeofday
__libc_csu_fini
php_inet_pton
zend_do_end_variable_parse
zend_compile_file
zim_spl_Array_hasChildren
zif_bindec
output_globals
php_strip_tags_ex
zif_bin2hex
zend_stack_destroy
string_compare_function
php_libxml_error_handler
php_ftp_functions
zif_file_put_contents
init_op
zim_reflection_property_export
sxe_object_new
zend_hash_graceful_destroy
zim_spl_SplFileObject_fpassthru
free_zend_constant
zif_str_word_count
zif_stream_copy_to_stream
zif_date_date_set
all_args_by_ref
zif_ftp_nb_fget
zendi_smart_strcmp
zif_rad2deg
zim_spl_LimitIterator_getPosition
zm_startup_date
php_regfree
libxml_module_entry
zend_do_if_cond
get_active_function_name
php_get_session_var
zif_set_include_path
zif_is_readable
zif_array_sum
zif_socket_set_option
zim_spl_CachingIterator_offsetUnset
reflection_class_ptr
zend_ptr_stack_n_pop
zend_indent
zim_spl_DirectoryIterator_next
zend_hash_clean
php_end_implicit_flush
zif_fseek
zif_getmyuid
zim_spl_SplObjectStorage_current
zif_preg_match
PHP_CRC32Final
zif_stream_context_get_default
zend_check_protected
zend_ini_double
zend_ini_sort_entries
php_shutdown_config
debug_print_backtrace_args
zim_spl_Array_offsetGet
php_error_docref0
zif_str_shuffle
zif_shell_exec
zend_user_it_invalidate_current
zim_spl_SplFileObject_fwrite
zim_spl_SimpleXMLIterator_valid
zif_fputcsv
php_if_fopen
zend_alter_ini_entry
cwd_globals
zim_spl_SplFileInfo_isFile
zif_convert_uuencode
php_register_variable
zif_chown
php_date_set_tzdb
_php_stream_fopen_from_pipe
php_base64_decode_ex
zend_object_store_ctor_failed
zim_spl_SplFileInfo_getPath
zend_ini_do_op
zim_reflection_class___toString
OnUpdateLong
zim_reflection_class_getExtension
zim_simplexml_element_getNamespaces
userfilter_filter
call_user_function
php_unescape_html_entities
zend_declare_property_long
JulianToSdn
_zval_dtor_func
zend_get_std_object_handlers
php_mergesort
php_libxml_increment_node_ptr
php_copy_file
zend_ini_color_displayer_cb
php_network_populate_name_from_sockaddr
zend_ts_hash_add_empty_element
zif_openssl_pkey_new
zim_spl_NoRewindIterator_next
get_timezone_info
zif_socket_recvfrom
zim_spl_RecursiveIteratorIterator_key
php_stristr
zm_startup_file
php_open_temporary_fd
zif_dngettext
zif_base64_decode
zend_destroy_file_handle
php_stream_xport_listen
zif_scandir
zim_spl_CachingIterator_setFlags
php_hash_5haval224_ops
zif_dl
zim_spl_SplFileObject_setMaxLineLen
zm_info_regex
sapi_get_fd
timelib_builtin_db
zif_hash_update_file
zend_ts_hash_merge_ex
zif_get_html_translation_table
php_filter_int
ftp_syst
zif_hash_hmac_file
zif_soundex
zif_gmp_divexact
php_filter_encoded
zend_make_compiled_string_description
zend_update_static_property_double
zim_spl_Array_getArrayCopy
zif_openssl_pkcs7_encrypt
php_ob_handler_used
ps_close_user
zend_hash_exists
zif_get_meta_tags
zend_register_constant
fetch_array_dim
PHP_TIGER192Final
spl_ce_SimpleXMLIterator
zif_spl_autoload_call
php_module_startup
zend_do_end_class_declaration
zend_unmangle_property_name
zend_objects_store_get_refcount
print_class
php_default_treat_data
_php_stream_temp_open
rfc1867_post_handler
ini__init_buffer
zif_get_magic_quotes_gpc
zif_dechex
php_network_connect_socket_to_host
zend_register_long_constant
zim_reflection_class_getName
ftp_reinit
zim_reflection_parameter_getDeclaringClass
zend_do_declare_begin
php_mt_srand
zm_startup_pcntl
php_stream_bucket_new
zend_reflection_class_factory
zif_pcntl_wifsignaled
zif_ftp_fget
php_hash_ripemd320_ops
zif_quoted_printable_decode
register_phpinfo_constants
zim_reflection_method_invokeArgs
plist_entry_destructor
zend_memory_peak_usage
zim_spl_SplFileObject_rewind
php_hash_3haval192_ops
zif_exif_thumbnail
zend_binary_zval_strncmp
php_stream_xport_recvfrom
zm_startup_reflection
zend_binary_strncmp
zend_do_verify_access_types
zif_parse_url
PHP_SHA256Update
zim_reflection_property___construct
virtual_unlink
spl_ce_UnderflowException
zend_do_foreach_begin
php_sig_jpg
zim_spl_SplFileObject_setCsvControl
php_zlib_module_entry
spl_ce_RecursiveCachingIterator
zend_vspprintf
zif_gmdate
zim_reflection_class_getConstants
zend_destroy_rsrc_list_dtors
php_XML_GetErrorCode
zend_memory_usage
zend_unset_timeout
zif_ini_set
spl_filesystem_info_set_filename
zif_getmygid
zim_reflection_parameter_getClass
_php_stream_read
zim_spl_SplFileInfo_getBasename
zend_do_begin_function_declaration
zend_objects_store_clone_obj
zif_str_repeat
PHP_HAVAL224Final
add_index_string
add_assoc_function
virtual_rmdir
_xml_characterDataHandler
zif_nl_langinfo
php_inet_ntop
php_stream_dirent_alphasortr
zend_ts_hash_num_elements
zend_register_functions
zif_pow
zend_get_constant_ex
php_mkdir
add_assoc_bool_ex
zend_delete_buffer
zif_tan
zm_shutdown_standard_filters
cfg_get_long
zend_llist_apply_with_del
zend_make_callable
spl_ce_RangeException
zif_exif_imagetype
zm_info_php_gettext
zend_fcall_info_args_save
zif_strpbrk
zim_reflection_parameter_getName
zend_do_isset_or_isempty
zend_restore_ini_entry
add_index_null
php_sig_jpc
zend_do_assign_ref
zif_array_keys
zif_checkdate
zif_mt_rand
spl_add_class_name
zif_is_finite
zif_iconv_get_encoding
zend_dynamic_array_pop
zim_reflection_class_getStartLine
_php_stream_scandir
zif_iterator_count
zm_info_gmp
_fp_hw
zim_spl_SplObjectStorage_rewind
spl_register_std_class
is_not_identical_function
sapi_globals
add_get_index_double
date_globals
zif_define_syslog_variables
zif_openssl_private_decrypt
_xml_externalEntityRefHandler
zif_shmop_open
zend_load_extension
php_hash_md2_ops
_php_find_ps_serializer
zend_do_halt_compiler_register
zim_spl_LimitIterator___construct
php_hash_gost_ops
OnUpdateReal
zif_gmp_clrbit
zend_hash_reverse_apply
php_store_class_name
zif_ob_get_clean
zend_stream_open
php_print_info
timelib_update_ts
zim_spl_DirectoryIterator_getBasename
zend_std_get_static_method
reflection_method_ptr
php_hash_3tiger160_ops
zim_spl_CachingIterator_next
zif_atanh
sapi_get_stat
zend_do_implements_interface
zend_get_type_by_const
zif_ngettext
php_stream_get_url_stream_wrappers_hash_global
zm_startup_dir
zend_get_class_fetch_type
zend_stream_ftell
php_hash_5haval192_ops
php_stream_xport_unregister
zif_ceil
zif_preg_replace_callback
zim_reflection_method_isPublic
zif_pclose
zend_class_add_ref
zend_exception_error
php_mkdir_ex
zif_iterator_apply
sapi_unregister_post_entry
zim_DateTime___construct
PHP_HAVAL192Final
zend_wrong_param_count
XML_GetUserData
spl_register_sub_class
zm_activate_dir
add_next_index_string
zim_exception_getCode
php_libxml_switch_context
zend_do_begin_dynamic_function_call
_zval_internal_dtor
SdnToJewish
php_date_global_timezone_db
tokenizer_module_entry
zend_object_store_get_object_by_handle
zif_array_reduce
spl_ce_AppendIterator
spl_ce_CachingIterator
zim_spl_AppendIterator_next
zif_sqrt
is_identical_function
_estrdup
zif_user_printf
zim_spl_RecursiveIteratorIterator_beginChildren
zim_reflection_class_export
zend_lookup_class_ex
multi_convert_to_double_ex
zif_readline
zend_hash_apply_with_argument
zif_escapeshellarg
php_libxml_node_free_resource
zif_proc_terminate
zif_gmp_neg
zm_startup_syslog
php_pcre_grep_impl
zif_getprotobyname
php_libxml_decrement_doc_ref
zim_spl_Array_asort
zif_is_file
zif_nl2br
php_url_free
zend_startup_module
zim_spl_Array_count
is_zend_mm
_php_stream_bz2open
php_fgetcsv
zim_spl_NoRewindIterator_rewind
zend_declare_class_constant_double
zim_reflection_class_getModifiers
add_next_index_bool
zend_restore_lexical_state
php_XML_ParserCreate_MM
php_stream_filter_register_factory_volatile
zif_system
OnUpdateDecode
zend_mm_shutdown
spl_add_classes
sapi_force_http_10
php_lookup_class_name
zend_ini_register_displayer
PHP_SHA1Update
zif_ftp_put
zm_deactivate_readline
timelib_dump_tzinfo
zif_php_sapi_name
zim_reflection_class_getStaticPropertyValue
timelib_astro_rise_set_altitude
php_hash_adler32_ops
zif_srand
zif_exif_tagname
iconv_globals
zm_info_reflection
php_XML_SetCommentHandler
zif_gmp_sqrtrem
zend_do_inheritance
zend_deactivate
zif_iconv_strpos
zend_delete_global_variable
_zval_internal_ptr_dtor
zif_xml_set_object
_php_stream_filter_prepend
boolean_xor_function
zif_socket_shutdown
php_XML_GetCurrentByteCount
_codes
zend_get_error_exception
zif_socket_bind
php_explode
zend_do_do_while_begin
php_stream_output_ops
zif_var_export
php_hash_md4_ops
zend_get_resource_handle
MonthNameShort
zim_spl_SplFileObject_getMaxLineLen
zif_gmp_strval
sapi_get_default_content_type_header
zend_verify_abstract_class
virtual_chdir
zif_hash
zend_do_end_function_declaration
zm_startup_shmop
_php_stream_mmap_range
add_property_double_ex
zim_spl_SplFileObject_fgetcsv
zif_print_r
zif_ob_start
zim_reflection_method___toString
php_gcvt
php_exec
zend_atol
zend_objects_proxy_free_storage
php_get_output_start_filename
PHP_SHA384Final
zif_array_count_values
zif_ftp_connect
ps_close_files
zim_spl_EmptyIterator_key
zif_openssl_csr_get_public_key
reflector_ptr
zif_openssl_x509_checkpurpose
zm_deactivate_sockets
zif_stream_context_get_options
_zend_mm_free
zif_user_filter_nop
reflection_module_entry
zend_object_std_dtor
php_verror
zif_simplexml_import_dom
zend_do_list_init
add_get_assoc_string_ex
convert_to_double
zend_do_if_after_statement
PHP_4HAVAL256Init
zend_scan_string
zim_spl_DirectoryIterator_rewind
sxe_get_element_class_entry
zif_register_tick_function
zif_ftp_rmdir
zend_mangle_property_name
zif_timezone_identifiers_list
zif_openssl_pkcs12_export_to_file
zm_info_assert
zim_spl_RegexIterator___construct
zif_time_nanosleep
increment_function
zif_pcntl_alarm
mod_function
php_remove_tick_function
zif_stream_wrapper_register
zend_llist_prepend_element
php_plain_files_wrapper
ps_read_files
zif_image_type_to_extension
php_init_stream_wrappers
zif_array_filter
php_sig_psd
zim_spl_SplFileObject_seek
zim_spl_Array_append
_php_stream_fopen
convert_to_object
zend_ini_shutdown
zim_reflection_function_isDeprecated
php_hash_4haval160_ops
zif_strtok
PHP_SNEFRUUpdate
php_XML_GetCurrentColumnNumber
zend_ts_hash_clean
_php_emit_fd_setsize_warning
ini_restart
php_stream_get_record
zif_array_uintersect_uassoc
spl_funcs_RecursiveIterator
spl_array_iterator_key
zendin
zim_reflection_class_getProperties
zim_spl_EmptyIterator_valid
php_filter_string
zif_vprintf
zim_spl_SplFileObject_getCsvControl
zif_str_ireplace
php_stream_filter_remove
ini__delete_buffer
add_property_stringl_ex
zm_startup_array
pcre_functions
php_getlastmod
zend_user_it_rewind
zend_compile_string
zif_chr
dir_globals
zif_proc_open
php_bz2_filter_factory
zif_pcntl_signal
php_stream_xport_register
zif_jdtojewish
virtual_cwd_shutdown
add_assoc_zval_ex
php_stream_from_persistent_id
zval_update_constant
php_stream_tidy_wrapper_error_log
zif_assert
zif_ftp_login
PHP_RIPEMD128Update
zim_reflection_function_getExtension
DayNameLong
timelib_daynr_from_weeknr
php_hash_register_algo
zim_reflection_parameter___toString
zim_spl_NoRewindIterator_current
spl_ce_SplTempFileObject
zend_unblock_interruptions
zif_openssl_x509_check_private_key
zif_xml_set_character_data_handler
zim_spl_RecursiveCachingIterator_getChildren
zif_socket_create_pair
zif_floatval
zif_call_user_method_array
zif_ftp_systype
zend_call_function
zm_deactivate_user_filters
php_stream_xport_crypto_enable
php_strip_url_passwd
zif_sin
zend_ts_hash_find
get_active_class_name
zif_getimagesize
zif_is_dir
zif_filter_input_array
zif_array_udiff
PHP_4TIGERInit
zim_reflection_class_hasMethod
zif_easter_date
php_get_current_user
timelib_day_of_year
realpath_cache_clean
zif_ini_get_all
_safe_erealloc
session_adapt_url
php_session_register_serializer
zend_ini_boolean_displayer_cb
add_index_resource
zim_reflection_extension_getVersion
zm_startup_nl_langinfo
zend_do_fcall
php_XML_SetEndNamespaceDeclHandler
zif_cal_info
zend_spprintf
zend_create_buffer
zim_spl_SplFileInfo_setFileClass
php_stream_notification_free
php_stream_rfc2397_wops
php_hash_4haval192_ops
zif_ftok
zend_disable_function
zend_user_it_new_iterator
timelib_get_time_zone_info
zif_filegroup
virtual_stat
zif_gmp_scan0
zif_proc_nice
ap_php_conv_10
php_tiff_bytes_per_format
zend_objects_store_add_ref_by_handle
zend_mm_get_storage
ini_lval
sapi_free_header
spl_ce_RegexIterator
spl_array_object_count_elements
zif_current
_php_stream_puts
virtual_lstat
zim_spl_SplFileInfo_getOwner
PHP_MD5Final
php_stream_context_get_link
zend_load_buffer_state
zend_unregister_functions
zim_spl_RecursiveRegexIterator_getChildren
php_std_auto_global_callback
php_network_parse_network_address_with_port
zend_function_dtor
fetch_string_offset
zim_spl_SplFileInfo___construct
zim_exception_getTrace
zim_spl_RecursiveIteratorIterator_nextElement
zend_ce_iterator
spl_functions_none
zif_memory_get_usage
zif_asinh
zend_unregister_ini_entries
php_sig_swc
php_stream_udp_socket_ops
zif_natsort
zif_date_default_timezone_set
zif_ftp_nb_continue
zend_do_for_cond
_php_math_number_format
JewishMonthHebName
PHP_RIPEMD256Update
bitwise_and_function
zif_ftp_nlist
init_compiler
php_request_shutdown_for_exec
zim_reflection_class_getProperty
zim_reflection_method_getModifiers
zend_hash_move_forward_ex
zim_spl_RecursiveDirectoryIterator_key
zif_preg_last_error
zif_xml_parser_get_option
reflection_function_abstract_ptr
zend_get_compiled_lineno
sub_function
zend_startup_module_ex
zim_reflection_property_getDocComment
spl_append_it_next_iterator
zend_ts_hash_destroy
zif_money_format
zif_ftp_mdtm
zend_register_standard_ini_entries
zif_array_product
zif_ftp_nb_fput
add_property_bool_ex
zend_print_zval
zend_ts_hash_rehash
zim_spl_SplFileInfo_getCTime
spl_ce_OutOfRangeException
php_stream_url_wrap_http
zif_convert_cyr_string
zim_reflection_object_export
zend_user_it_get_current_key
zend_scan_bytes
expand_filepath_ex
php_stripslashes
zend_llist_get_last_ex
zm_shutdown_simplexml
filter_functions
zm_activate_date
zend_next_free_module
zend_get_object_classname
zend_clean_module_rsrc_dtors
zif_ftp_rename
zm_info_xml
zif_flock
zend_set_utility_values
timelib_time_offset_ctor
php_session_register_module
zif_array_merge
zval_update_constant_ex
get_zend_version
zif_is_infinite
zend_highlight
zif_timezone_transitions_get
zif_date_isodate_set
php_request_startup
get_token_type_name
zif_ignore_user_abort
zif_phpinfo
multi_convert_to_string_ex
zim_reflection_extension_getINIEntries
zend_update_property_bool
zend_do_boolean_or_begin
day_full_names
zm_info_pcntl
php_escape_shell_arg
shmop_globals
php_trim
zif_strnatcmp
php_info_print_table_header
php_session_create_id
zim_spl_Array_offsetUnset
php_basename
SdnToJulian
zend_stack_del_top
zif_log1p
zif_socket_set_block
_php_stream_filter_alloc
zim_reflection_property_isDefault
php_info_print_table_row
bitwise_not_function
zim_reflection_function_invoke
zend_startup_modules
zif_is_nan
php_escape_html_entities_ex
zif_hash_update
zend_declare_class_constant_bool
zif_gmp_perfect_square
zend_funcs_aggregate
PHP_MD5Update
zim_reflection_extension_getClassNames
zend_std_object_get_class
ps_mod_files
php_stream_url_wrap_http_ex
zend_compare_symbol_tables_i
php_mail
php_srand
zif_ereg
timelib_tzinfo_ctor
zend_ini_init_string
zim_reflection_class_getConstant
spl_ce_SplObserver
zif_stream_is_local
zif_iconv_mime_decode
zend_do_implement_interface
zif_phpcredits
ps_open_user
PHP_ADLER32Init
zend_startup_builtin_functions
zend_scan_buffer
timelib_iso_day_of_week
php_strip_tags
zim_reflection_class___construct
spl_array_it_funcs
shutdown_destructors
zif_ob_list_handlers
zif_file
timelib_time_dtor
ap_php_vsnprintf
simplexml_functions
zif_stream_socket_accept
php_hash_5haval160_ops
zif_stream_get_line
zim_reflection_function_getStaticVariables
zim_reflection_getModifierNames
spl_ce_SeekableIterator
PHP_SHA1Init
zif_date_sun_info
php_shutdown_temporary_directory
zend_class_implements
zif_getservbyname
php_mt_rand
zim_spl_SplFileInfo_getPerms
zif_pcntl_waitpid
zif_socket_clear_error
php_filter_number_int
zif_abs
zif_serialize
zif_realpath
zim_reflection_property_isPublic
php_info_print_hr
zim_spl_Array_getChildren
zif_call_user_method
zif_opendir
zm_shutdown_assert
zif_sinh
php_tag_find
zim_spl_SimpleXMLIterator_current
php_XML_SetUnparsedEntityDeclHandler
php_idate
zif_gmp_invert
php_ini_scanned_path
zend_read_static_property
function_add_ref
zend_hash_set_pointer
php_request_shutdown_for_hook
zim_exception_getFile
zim_spl_InfiniteIterator___construct
php_open_temporary_fd_ex
zif_pcntl_wtermsig
zm_startup_browscap
sapi_activate_headers_only
reg_globals
zif_ftp_mkdir
zif_array_walk
zif_ftp_chmod
zend_print_variable
free_estring
zend_object_store_get_object
php_if_md5
zend_ini_get_constant
DayNameShort
zend_stack_count
zend_startup_strtod
zend_do_print
php_hash_3haval224_ops
OnUpdateEncode
zif_openssl_public_encrypt
zif_tanh
simplexml_export_node
php_pcre_match_impl
php_filter_number_float
zif_openssl_verify
zm_activate_syslog
zif_ord
zif_usort
_zend_list_addref
zend_fcall_info_call
zif_shmop_close
php_stream_locate_url_wrapper
zend_execute_internal
zif_rewind
php_debug_zval_dump
zend_objects_destroy_object
instanceof_function
zend_shutdown_strtod
zim_reflection_class_getParentClass
zend_llist_sort
zend_ini_prepare_string_for_scanning
php_stream_context_get_option
zif_rawurldecode
zend_do_end_function_call
zif_openssl_pkcs7_decrypt
php_XML_Parse
php_stream_filter_free
init_ini_scanner
php_utf32_utf8
zim_spl_Array_getFlags
zend_llist_clean
PHP_SHA384Update
zend_init_rsrc_list_dtors
zend_get_parameters
_php_stream_eof
php_next_meta_token
php_stream_xport_sendto
php_url_parse_ex
zif_exec
zend_update_class_constants
zend_stack_top
zif_ob_end_flush
zif_htmlentities
make_sha1_digest
zend_do_end_catch
call_user_function_ex
php_format_date
simplexml_module_entry
div_function
zend_parse_parameters_ex
spl_module_entry
php_if_lstat
zif_getcwd
PHP_GOSTInit
php_checkuid
zif_ftp_pwd
zif_xml_set_default_handler
zif_jdtojulian
zim_spl_SplFileInfo_isReadable
zim_spl_SplFileObject_next
zif_pfsockopen
php_error_docref1
get_binary_op
convert_to_null
zif_xml_set_end_namespace_decl_handler
_zend_ts_hash_index_update_or_next_insert
zif_ftp_raw
zim_spl_SimpleXMLIterator_count
zif_strnatcasecmp
php_if_md5_file
zm_startup_miconv
zend_register_string_constant
zif_date_modify
zend_reset_all_cv
zm_startup_spl_directory
spl_ce_LogicException
php_pcre_replace
zif_setcookie
zend_do_unary_op
PHP_RIPEMD320Update
_php_find_ps_module
zim_reflection_class_isSubclassOf
_php_stream_cast
php_stream_xport_shutdown
zif_vfprintf
virtual_open
zim_simplexml_element_addAttribute
zim_spl_SplFileObject_hasChildren
zif_connection_status
zif_iconv_substr
zif_socket_select
zend_ini_startup
zif_fileowner
zif_str_pad
zm_info_tokenizer
zim_spl_SimpleXMLIterator_key
zif_gmstrftime
zim_spl_AppendIterator_append
zend_do_add_array_element
zif_ucfirst
zend_merge_properties
exif_functions
php_shutdown_ticks
PHP_SNEFRUFinal
zif_array_shift
zend_binary_zval_strcmp
zend_register_standard_constants
php_handle_aborted_connection
zif_socket_last_error
zif_memory_get_peak_usage
compile_filename
zm_info_simplexml
zif_openssl_pkey_export
zif_hash_init
zif_xml_parser_create_ns
zend_dynamic_array_init
ps_gc_user
zend_throw_exception_internal
_ecalloc
zif_hebrev
zim_spl_Array_rewind
zif_strval
php_network_accept_incoming
zif_exp
zend_oct_strtod
register_string_constants
zm_shutdown_exif
php_stream_notification_notify
zif_class_parents
convert_to_array
add_next_index_long
zif_ftp_ssl_connect
zend_hash_quick_exists
spl_ce_InvalidArgumentException
zim_spl_RecursiveIteratorIterator_getDepth
zif_openssl_csr_sign
zend_do_qm_false
zend_do_begin_qm_op
php_get_stream_filters_hash_global
zend_make_printable_zval
zif_connection_aborted
virtual_popen
zend_fetch_resource
zend_write
zend_output_debug_string
zend_do_receive_arg
openssl_functions
zif_is_long
zif_iconv_mime_encode
php_stream_bz2io_ops
spl_ce_SimpleXMLElement
zend_set_hash_symbol
zim_reflection_extension___toString
add_assoc_string_ex
zif_ini_get
zend_hash_add_empty_element
zif_xml_parser_create
zend_object_proxy_set
gmp_globals
zim_spl_SplFileObject_getChildren
zend_binary_strncasecmp
zend_alter_ini_entry_ex
zim_spl_SplObjectStorage_contains
zm_shutdown_date
yytext
zif_xml_set_element_handler
php_dirname
zend_do_handle_exception
zend_do_extended_fcall_end
zif_array_udiff_uassoc
zend_mm_set_heap
timelib_parse_tzfile
zif_import_request_variables
zif_mktime
zend_stack_is_empty
__data_start
zif_pack
zend_do_mark_last_catch
zim_spl_SplTempFileObject___construct
zim_reflection_class_hasProperty
php_strspn
zim_spl_RecursiveRegexIterator___construct
php_strtoupper
php_iconv_string
zend_lookup_class
zend_html_puts
pass_two
zim_spl_SimpleXMLIterator_next
php_handle_auth_data
php_copy_file_ex
timelib_timezone_abbreviations_list
zend_do_while_cond
file_globals
zim_DateTimeZone___construct
zim_spl_RegexIterator_setMode
zif_textdomain
pcre_get_compiled_regex_cache
php_replace_controlchars_ex
php_run_ticks
spl_array_iterator_append
zend_zval_type_name
php_strlcat
zim_simplexml_element_attributes
timelib_do_normalize
zend_hash_get_pointer
php_libxml_structured_error_handler
zif_stream_get_contents
reflection_exception_ptr
zim_spl_Array___construct
php_header
php_hash_whirlpool_ops
zenderror
zif_ob_clean
zend_get_zval_ptr
php_filter_callback
zend_do_free
php_implode
zend_do_early_binding
zend_do_instanceof
JewishToSdn
_php_stream_putc
executor_globals
zend_iterator_wrap
zif_chgrp
zim_spl_NoRewindIterator_valid
zend_clear_exception
iconv_functions
zim_reflection_class_isInstance
zend_get_user_opcode_handler
zend_error
php_hash_ripemd256_ops
zif_syslog
zim_reflection_function_isUserDefined
_php_stream_sock_open_host
zif_microtime
zend_objects_get_address
zif_range
zif_implode
zim_spl_SplFileInfo_getSize
zim_spl_RegexIterator_getMode
php_url_encode_hash_ex
zif_timezone_name_from_abbr
zif_chunk_split
php_info_html_esc
php_clear_stat_cache
zif_fscanf
ap_php_snprintf
php_stream_filter_register_factory
zif_readline_clear_history
decrement_function
numeric_compare_function
zendout
zend_auto_global_arm
_php_stream_copy_to_stream
zif_array_multisort
shutdown_memory_manager
zif_stream_socket_client
zif_get_include_path
ftp_nb_continue_read
zif_substr_compare
php_info_print_style
spl_ce_UnexpectedValueException
zend_ini_close_file
concat_function
virtual_access
PHP_3HAVAL192Init
zend_ts_hash_reverse_apply
zm_shutdown_miconv
zend_init_opcodes_handlers
zend_do_pre_incdec
zim_spl_SplFileInfo_getInode
zim_spl_SplFileObject_fgets
php_info_print_module
php_check_open_basedir
zend_fopen
zif_gmp_pow
zend_get_executed_filename
ps_globals
PHP_4HAVAL192Init
virtual_fopen
php_std_date
php_regcomp
zm_info_calendar
zm_activate_filestat
zim_spl_Array_getIteratorClass
spl_ce_ParentIterator
zend_do_foreach_end
spl_ce_DirectoryIterator
zend_hash_func
zif_socket_recv
zim_spl_Array_seek
zend_stream_fixup
zend_objects_store_add_ref
zim_spl_SplFileObject_current
reflection_ptr
spl_object_storage_attach
zim_spl_RegexIterator_setFlags
zim_spl_SplFileObject_fgetc
shutdown_executor
zim_spl_LimitIterator_rewind
php_stream_parse_fopen_modes
zend_objects_store_del_ref_by_handle
zim_spl_CachingIterator_offsetSet
zif_pathinfo
zif_html_entity_decode
zval_is_true
sapi_header_op
zim_reflection_method_export
add_next_index_double
spl_ce_BadFunctionCallException
zim_reflection_class_getDocComment
php_hash_4tiger192_ops
zend_register_default_exception
zend_funcs_traversable
php_get_highlight_struct
zif_in_array
zif_lchown
lex_scan
zif_openssl_pkey_get_public
php_escape_html_entities
_convert_to_string
zif_ftp_nb_get
zif_gmp_com
zend_exception_get_default
zif_error_log
_zval_ptr_dtor
zm_startup_proc_open
php_hash_sha512_ops
zim_spl_CachingIterator_hasNext
zm_shutdown_url_scanner_ex
timelib_ts_to_juliandate
zif_mkdir
php_open_temporary_file
zm_startup_spl_iterators
php_base64_decode
zif_shmop_size
zend_funcs_arrayaccess
php_hash_3tiger192_ops
php_hash_4tiger160_ops
zif_mt_srand
inet_ntoa_lock
zim_reflection_class_newInstance
zend_std_call_user_call
php_uuencode
php_stream_temp_ops
ini__create_buffer
zim_spl_RecursiveIteratorIterator_valid
php_stream_gzopen
PHP_CRC32Update
zm_startup_calendar
_xml_unparsedEntityDeclHandler
zif_ini_restore
php_set_session_var
zend_get_module_started
zim_reflection_function_getEndLine
bitwise_or_function
zif_dcngettext
zend_do_declare_property
zif_token_get_all
zif_rsort
zend_objects_new
timelib_update_from_sse
shutdown_scanner
zim_spl_SplFileInfo_isWritable
php_combined_lcg
zif_stream_socket_sendto
zif_array_splice
_php_stream_xport_create
zim_spl_RecursiveDirectoryIterator_getChildren
zif_xml_get_error_code
zif_fwrite
zend_hash_compare
zif_stristr
_zend_hash_quick_add_or_update
filter_globals
zif_openssl_pkcs12_export
zend_do_boolean_and_begin
php_lint_script
zif_timezone_open
zm_startup_lcg
php_startup_ticks
destroy_op_array
zend_vm_set_opcode_handler
zif_getrusage
zif_stream_get_transports
zend_std_get_static_property
zend_do_begin_catch
zim_spl_RecursiveIteratorIterator_current
ini__scan_string
zend_is_auto_global
zif_array_pad
zif_compact
zim_spl_SplFileObject_ftell
php_stream_bucket_append
zim_spl_NoRewindIterator___construct
zend_string_to_double
php_libxml_node_decrement_resource
zif_stream_socket_pair
spl_filesystem_dir_it_funcs
php_strftime
zend_fcall_info_args
PHP_SHA256Final
ps_srlzr_encode_php_binary
php_sockaddr_size
zif_rtrim
PHP_RIPEMD160Init
zif_date
zm_info_exif
zim_reflection_class_getFileName
zm_startup_pack
php_getopt
add_index_bool
zm_startup_tokenizer
zim_spl_EmptyIterator_rewind
zend_extensions
zif_base_convert
zim_spl_DirectoryIterator_valid
zim_spl_SplFileInfo_openFile
zend_initialize_class_data
zend_strndup
zim_spl_CachingIterator_offsetGet
zif_pcntl_wait
zif_version_compare
zend_ts_get_hash_value
php_stream_context_set
SdnToGregorian
zend_destroy_rsrc_list
php_end_ob_buffer
zend_ptr_stack_n_push
zend_binary_zval_strncasecmp
zif_date_sunset
php_sig_tif_ii
zim_reflection_method_getDeclaringClass
spl_register_parent_ce
virtual_getcwd_ex
string_locale_compare_function
zm_activate_basic
spl_ce_RecursiveRegexIterator
PHP_RIPEMD128Init
zend_update_static_property_long
zim_spl_CachingIterator_getCache
zend_freedtoa
spl_ce_DomainException
zend_startup
zif_simplexml_load_string
zif_output_reset_rewrite_vars
php_stream_generic_socket_ops
zim_exception_getMessage
zif_getlastmod
php_stream_xport_connect
ftp_nb_continue_write
php_filter_validate_regexp
zif_acos
php_libxml_xmlCheckUTF8
shm_type
zim_simplexml_element_asXML
spl_add_interfaces
spl_ce_InfiniteIterator
zm_shutdown_hash
_object_init_ex
zif_levenshtein
zif_openssl_csr_export_to_file
zif_get_current_user
zend_check_magic_method_implementation
zim_simplexml_element_getDocNamespaces
zend_on_timeout
zif_hebrevc
php_free_shutdown_functions
zif_decbin
zim_spl_RecursiveDirectoryIterator_getSubPathname
zif_xml_set_unparsed_entity_decl_handler
zif_is_executable
timelib_tzinfo_clone
zif_iptcparse
_zend_get_parameters_array
php_stream_ftp_wrapper
zif_idate
zend_parse_method_parameters
php_get_temporary_directory
virtual_creat
zend_ts_hash_graceful_destroy
zim_spl_SplObjectStorage_serialize
zend_declare_property_null
spl_ce_IteratorIterator
zif_array_fill
zif_output_add_rewrite_var
zend_do_add_variable
zm_shutdown_browscap
spl_hash_verify_pos
_php_stream_printf
zend_hash_index_find
zend_llist_count
php_register_url_stream_wrapper
zif_array_flip
zif_count_chars
zend_do_for_end
php_com_initialize
_php_stream_write
zif_array_intersect_ukey
php_url_decode
zif_ftp_nb_put
zim_spl_SplFileInfo_getMTime
zif_array_diff_ukey
zif_headers_list
zif_split
ps_mod_user
zif_popen
zif_symlink
zif_getrandmax
ftp_open
zend_do_do_while_end
zif_gmp_prob_prime
virtual_opendir
zif_gregoriantojd
zif_ftp_get_option
php_stream_php_wrapper
php_html_puts
zim_spl_SplObjectStorage_count
cfg_get_double
php_stream_stdio_ops
zif_move_uploaded_file
php_openssl_apply_verification_policy
zif_spl_autoload_functions
zim_spl_SplFileObject_ftruncate
zend_cleanup_function_data
virtual_getcwd
cfg_get_entry
zim_spl_dual_it_next
zif_openssl_open
zend_activate_modules
zif_shuffle
zend_get_module_version
php_ftp_module_entry
php_canonicalize_version
php_info_print_css
spl_ce_SplFileObject
zm_info_shmop
php_stream_ftp_opendir
zim_exception___construct
zim_reflection_parameter_export
zend_do_pop_object
zif_preg_match_all
zend_do_fetch_static_member
zif_strip_tags
zend_check_writable_variable
zif_gmp_setbit
zend_user_it_valid
zif_setlocale
PHP_RIPEMD160Final
spl_globals
zif_intval
zif_ftp_close
zif_gmp_scan1
zend_std_cast_object_tostring
zend_fetch_list_dtor_id
sxe_class_entry
zend_auto_global_disable_jit
zim_spl_RecursiveDirectoryIterator_getSubPath
zif_strrchr
zif_hash_hmac
zif_decoct
zim_spl_Array_uasort
zim_spl_RecursiveIteratorIterator_getSubIterator
zim_spl_dual_it_key
_php_stream_truncate_set_size
zim_spl_DirectoryIterator_getFilename
PHP_HAVAL256Final
zend_do_case_before_statement
PHP_GOSTFinal
zif_xml_get_current_byte_index
PHP_HAVAL128Final
zend_hash_internal_pointer_end_ex
zendrestart
zif_quotemeta
exif_module_entry
zif_array_walk_recursive
zend_compare_arrays
zim_spl_SplFileInfo_getRealPath
timelib_timezone_id_from_abbr
pcre_module_entry
zif_file_exists
zif_array_udiff_assoc
php_XML_ExpatVersion
zif_spl_object_hash
zim_reflection_function_getExtensionName
spl_ce_BadMethodCallException
zend_do_try
zif_basename
add_get_index_long
spl_filesystem_tree_it_funcs
add_next_index_stringl
zif_pcntl_setpriority
php_parse_date
zim_reflection_extension_getFunctions
zif_readline_callback_handler_remove
zim_spl_RecursiveFilterIterator___construct
zend_throw_exception_ex
zif_restore_include_path
zm_startup_spl
zend_hash_index_exists
_zend_get_parameters_array_ex
zif_date_create
php_if_ftruncate
shift_right_function
zif_socket_listen
zend_block_interruptions
zif_xml_parse
add_string_to_string
zend_execute
zim_reflection_function_getName
zif_iconv_strlen
zif_socket_create
zim_reflection_class_isAbstract
reflection_ext_functions
zif_array_fill_keys
php_printf
compiler_globals
date_ce_timezone
do_bind_class
tokenizer_register_constants
zim_spl_SplFileObject_fflush
zif_xml_get_current_column_number
zim_spl_SplFileInfo_getATime
zim_reflection_function_getParameters
zim_reflection_class_getInterfaces
ctype_module_entry
zif_expm1
zim_reflection_class_getExtensionName
zim_spl_SplFileObject_getFlags
timelib_timezone_id_is_valid
sapi_add_header_ex
spl_ce_LengthException
bitwise_xor_function
php_XML_SetUserData
zm_deactivate_assert
zif_hexdec
PHP_CRC32BUpdate
zim_spl_RecursiveDirectoryIterator___construct
zend_startup_constants
zend_uv
php_var_export_ex
zend_hash_quick_find
zend_str_tolower_copy
zend_update_property_null
add_next_index_resource
zif_stream_filter_remove
zm_startup_imagetypes
zif_fflush
zif_stream_filter_register
zim_exception___toString
zend_objects_store_put
zif_get_magic_quotes_runtime
zim_reflection_function_export
PHP_3HAVAL128Init
zif_filter_var_array
PHP_SHA1Final
zif_tempnam
zend_printf
php_regexec
zif_max
sockets_globals
php_str_to_str
zend_hash_destroy
zend_get_configuration_directive
zend_ini_deactivate
zim_spl_CachingIterator_count
php_log_err
zend_disable_class
_php_stream_temp_create
zif_is_object
zif_openssl_error_string
zif_ftp_size
zim_reflection_parameter_getDeclaringFunction
zif_constant
zval_property_ctor
php_fopen_with_path
php_XML_SetStartNamespaceDeclHandler
zif_time_sleep_until
zif_fileatime
php_reg_replace
php_hash_3tiger128_ops
zif_base64_encode
zif_ftp_alloc
zif_array_diff_uassoc
zif_token_name
zend_do_clone
timelib_dump_date
ps_gc_files
timelib_timestamp_is_in_dst
zend_declare_property
zim_spl_LimitIterator_next
php_stream_userspace_ops
zim_spl_RecursiveFilterIterator_hasChildren
php_output_activate
__libc_csu_init
zim_spl_Array_offsetSet
spl_recursive_it_iterator_funcs
php_execute_script
zif_readline_write_history
array_globals
zend_visibility_string
timelib_fill_holes
php_rfc1867_register_constants
php_sig_swf
zend_object_proxy_get
spl_filesystem_dir_get_iterator
zif_fsockopen
zif_is_callable
add_function
php_stream_filter_prepend_ex
zend_hash_num_elements
php_hash_4haval256_ops
zim_reflection_method_isFinal
tokenizer_functions
zm_startup_url_scanner_ex
php_hash_4haval128_ops
zif_readline_read_history
ini__scan_buffer
php_stream_context_set_option
zim_reflection___clone
zend_init_compiler_data_structures
zim_reflection_class_getStaticProperties
php_info_print_table_end
zend_getenv
ftp_gc
zif_set_magic_quotes_runtime
zend_declare_class_constant_string
PHP_SHA512Final
zim_spl_Array_current
php_stream_filter_unregister_factory
zif_getenv
zim_reflection_extension_getDependencies
zim_reflection_parameter_getDefaultValue
zif_gmp_intval
zif_socket_accept
zim_reflection_class_getMethod
zif_min
PHP_4HAVAL160Init
php_hash_crc32_ops
destroy_zend_class
zm_info_sockets
ap_php_vslprintf
php_strcspn
zim_reflection_extension_getClasses
zim_spl_IteratorIterator___construct
zm_info_filter
spl_iterator_apply
timelib_apply_localtime
zm_shutdown_openssl
php_libxml_register_export
PHP_RIPEMD320Final
spl_register_property
zif_openssl_pkcs7_verify
zif_pcntl_wexitstatus
zend_do_if_end
zif_ereg_replace
zim_spl_SplFileInfo_getFileInfo
php_dl
virtual_file_ex
zm_activate_url_scanner_ex
zif_iconv_strrpos
zim_reflection_method_isConstructor
zif_escapeshellcmd
php_mktime
first_arg_force_ref
php_hash_snefru_ops
zif_header
_php_stream_fopen_with_path
_php_stream_set_option
zm_info_mail
zif_gmp_div_qr
_zend_mm_alloc
startup_scanner
timelib_get_tz_abbr_ptr
zend_do_cast
zim_simplexml_element_addChild
zif_ezmlm_hash
php_strtr
php_stream_notification_alloc
zend_parse_method_parameters_ex
zend_ts_hash_quick_find
virtual_realpath
_object_init
ftp_quit
zif_long2ip
zim_reflection_method_isDestructor
php_escape_shell_cmd
_zend_mem_block_size
zend_auto_global_dtor
zif_array_chunk
zend_do_declare_implicit_property
zm_shutdown_basic
zend_do_extended_fcall_begin
php_unregister_url_stream_wrapper_volatile
zend_llist_apply
zif_pcntl_getpriority
zm_startup_spl_exceptions
zif_stream_set_timeout
php_startup_sapi_content_types
convert_to_boolean
_php_get_stream_filters_hash
zim_spl_RecursiveIteratorIterator_getInnerIterator
zend_do_extended_info
zif_iconv_mime_decode_headers
php_file_le_stream_filter
zendlex
zif_gettype
zif_closelog
zif_jdtogregorian
virtual_filepath
zif_get_cfg_var
zim_spl_RecursiveIteratorIterator_setMaxDepth
_php_stream_free
PHP_3HAVAL256Init
zim_simplexml_element_registerXPathNamespace
php_XML_SetExternalEntityRefHandler
zim_spl_RecursiveIteratorIterator_next
php_hash_4haval224_ops
zend_is_true
php_request_startup_for_hook
zend_do_push_object
zend_register_ini_entries
zif_array_combine
spl_handler_ArrayObject
zend_do_add_string
shutdown_compiler
zif_stream_bucket_prepend
zim_simplexml_element_children
zif_gmp_powm
do_bind_inherited_class
zim_reflection_method_isAbstract
date_ce_date
zim_spl_CachingIterator_offsetExists
zif_link
zif_krsort
zif_unserialize
zif_glob
PHP_SHA384Init
php_output_set_status
zif_openssl_csr_export
zend_stream_open_function
zif_strtolower
php_start_ob_buffer_named
zif_is_bool
php_if_crc32
php_info_print_table_start
_zend_ts_hash_quick_add_or_update
zif_stream_get_meta_data
php_XML_GetCurrentLineNumber
zif_chdir
zend_extension_dtor
zif_spl_autoload
zend_hash_find
third_arg_force_ref
zend_do_begin_method_call
sapi_get_target_gid
php_regerror
php_body_write
zim_spl_RecursiveIteratorIterator_endChildren
zif_phpversion
zif_call_user_func_array
php_var_dump
php_libxml_shutdown
zend_get_scanned_file_offset
assert_globals
zend_hash_internal_pointer_reset_ex
zim_spl_AppendIterator_rewind
mon_full_names
zif_timezone_name_get
php_setcookie
zif_pcntl_fork
ini__switch_to_buffer
php_quot_print_decode
zif_openssl_x509_parse
zend_ts_hash_minmax
zif_rename
zval_update_constant_no_inline_change
zend_hash_move_backwards_ex
zif_array_unshift
zif_date_parse
php_hash_ripemd128_ops
zend_do_echo
zim_spl_NoRewindIterator_key
php_gettext_module_entry
zim_spl_LimitIterator_valid
php_check_open_basedir_ex
zm_deactivate_basic
zend_post_deactivate_modules
spl_ce_RecursiveArrayIterator
zif_var_dump
php_error_docref2
zif_openssl_pkey_get_private
zend_ini_string
zif_ftp_chdir
_zend_ts_hash_add_or_update
zif_array_search
zm_info_basic
hash_functions
zif_ftp_site
zim_reflection_parameter_isArray
php_file_le_stream
zim_spl_SplFileInfo_getPathInfo
zif_substr
zim_spl_RegexIterator_accept
zif_ob_get_flush
add_get_index_string
PHP_MD4Final
zif_mail
zim_spl_DirectoryIterator_current
zim_spl_DirectoryIterator___construct
zif_usleep
zend_get_extension
zend_get_executed_lineno
zm_deactivate_spl
sapi_startup
zif_filectime
zif_shmop_delete
php_header_write
php_set_sock_blocking
add_index_long
zend_update_static_property
zend_ts_hash_index_exists
zif_socket_write
php_hash_3haval128_ops
php_conv_fp
zim_spl_RecursiveIteratorIterator_callHasChildren
php_get_nan
basic_functions_module
zim_reflection_method_isProtected
_php_stream_fopen_tmpfile
cli_is_valid_code
reflection_function_ptr
zm_deactivate_filter
zif_addslashes
zend_compare_symbol_tables
zend_ptr_stack_init
php_stream_bucket_split
_php_math_basetolong
php_sxe_move_forward_iterator
php_getimagetype
spl_destroy_class
zif_ftp_pasv
php_create_incomplete_class
zend_llist_init
zif_openssl_pkey_get_details
zif_gmp_hamdist
zif_spl_classes
zend_declare_class_constant_long
zend_llist_remove_tail
php_file_le_pstream
php_hash_5haval256_ops
timelib_decimal_hour_to_hms
multisort_compare
_php_stream_tell
sapi_deactivate
php_unregister_url_stream_wrapper
zif_stream_bucket_make_writeable
php_deactivate_ticks
JewishMonthName
spl_append_it_next
zend_declare_property_double
zif_spl_autoload_register
zend_update_property_double
SdnToFrench
zend_strip
zif_stream_set_write_buffer
zif_lcg_value
zif_hash_final
zend_funcs_iterator
zm_shutdown_file
zend_llist_get_prev_ex
zim_spl_AppendIterator___construct
zif_socket_close
zend_hash_graceful_reverse_destroy
zif_hypot
zm_info_miconv
php_libxml_ctx_error
add_index_stringl
zif_pcntl_wifexited
zif_openssl_x509_export
zif_jdmonthname
zif_number_format
timelib_time_offset_dtor
zim_reflection_class_hasConstant
zm_startup_spl_sxe
timelib_unixtime2gmt
zif_spl_autoload_extensions
zif_cal_from_jd
zif_array_diff_key
zend_do_indirect_references
zif_gettext
zend_startup_extensions
zm_shutdown_regex
_estrndup
zif_trim
zif_str_rot13
zif_hash_update_stream
zif_spliti
zend_stream_read
zend_stack_apply_with_argument
spl_register_interface
zif_file_get_contents
zif_proc_close
zend_dynamic_array_push
register_html_constants
virtual_filepath_ex
zm_info_ftp
php_stream_userspace_dir_ops
zif_htmlspecialchars
virtual_mkdir
virtual_rename
_php_stream_make_seekable
ini__flush_buffer
php_check_safe_mode_include_dir
zim_spl_CachingIterator___construct
zend_stack_apply
zif_juliantojd
zim_reflection_class_setStaticPropertyValue
zend_objects_clone_obj
date_funcs_date
zif_array_intersect_uassoc
php_url_scanner_adapt_single_url
PHP_SHA512Update
_xml_defaultHandler
php_signal
php_stream_unixdg_socket_ops
_php_stream_mkdir
zif_date_offset_get
_zend_ts_hash_init_ex
php_ob_get_length
ini_scanner_globals
zif_ftp_exec
spl_ce_FilterIterator
spl_ce_NoRewindIterator
add_index_zval
zim_spl_SplFileObject_valid
zif_gmp_sub
php_register_signal_constants
zif_rand
zend_std_object_get_class_name
zif_stream_socket_get_name
_php_math_basetozval
PHP_WHIRLPOOLUpdate
php_rfc1867_callback
php_start_implicit_flush
zend_eval_string
php_sig_jp2
zif_gethostbyaddr
_php_stream_copy_to_stream_ex
zend_do_boolean_and_end
zif_filter_input
is_not_equal_function
zend_binary_strcmp
make_digest_ex
zif_socket_read
is_smaller_function
PHP_3HAVAL224Init
zm_info_date
zif_cal_to_jd
add_next_index_null
virtual_chmod
zif_stream_wrapper_restore
sapi_flush
zif_touch
php_XML_SetCharacterDataHandler
zend_call_destructors
zend_fetch_debug_backtrace
zend_error_noreturn
php_stream_context_alloc
zif_sleep
zif_gmp_mod
add_property_zval_ex
zif_gmp_div_q
zim_simplexml_element_getName
zif_array_intersect
timelib_time_tz_abbr_update
php_stream_locate_eol
php_hash_4tiger128_ops
zend_register_internal_class
php_module_shutdown_for_exec
zif_openssl_seal
zim_spl_RecursiveIteratorIterator_beginIteration
zim_spl_Array_exchangeArray
zif_strstr
php_ob_get_buffer
add_index_double
zim_reflection_function___construct
zend_do_begin_class_member_function_call
add_assoc_null_ex
zend_do_fetch_class_name
reflection_extension_ptr
zim_spl_SplFileObject_flock
zim_spl_RecursiveCachingIterator___construct
zif_htmlspecialchars_decode
zend_llist_destroy
zend_do_shell_exec
zif_get_browser
PHP_4HAVAL128Init
zim_spl_dual_it_valid
is_equal_function
zend_hash_apply
zif_array_merge_recursive
timelib_tzinfo_dtor
zif_array_push
zif_display_disabled_function
zim_reflection_extension_export
zend_iterator_unwrap
zim_spl_RegexIterator_getPregFlags
zend_parse_ini_file
php_filter_validate_email
zif_unpack
zif_bind_textdomain_codeset
zm_startup_assert
zim_spl_SplFileObject_fgetss
php_sscanf_internal
zif_stream_context_create
zif_fileinode
zif_socket_getpeername
timelib_timezone_builtin_identifiers_list
zend_update_property_string
php_var_serialize
zif_stream_bucket_append
zim_spl_RegexIterator_getFlags
zm_info_dl
zend_stack_push
zif_sscanf
zif_reset
zend_objects_proxy_clone
_php_stream_stat_path
php_sig_bmp
php_default_post_reader
zend_llist_get_next_ex
virtual_chdir_file
zend_do_foreach_cont
zif_localtime
timelib_get_current_offset
zend_init_rsrc_list
zim_reflection_function_invokeArgs
basic_globals
zif_socket_sendto
zif_gmp_nextprime
zim_exception_getLine
PHP_SNEFRUInit
php_stream_dirent_alphasort
zend_is_callable_ex
zif_stream_wrapper_unregister
zend_do_declare_class_constant
zend_get_compiled_filename
_php_stream_opendir
zif_stream_bucket_new
var_destroy
php_date_short_day_name
zim_spl_SplObjectStorage_key
php_openssl_socket_ops
zim_simplexml_element_xpath
zend_object_create_proxy
php_filter_special_chars
zif_preg_quote
php_char_to_str
zim_reflection_class_isInterface
zim_spl_Array_ksort
zim_spl_RecursiveCachingIterator_hasChildren
zm_shutdown_pcntl
zif_array_intersect_key
zif_substr_replace
zend_hash_next_free_element
zif_ftp_delete
php_hash_3haval160_ops
_php_error_log
ini__load_buffer_state
zend_compare_objects
zif_dgettext
zend_save_lexical_state
error_exception_ce
php_XML_SetDefaultHandler
_xml_processingInstructionHandler
xml_encodings
PHP_5HAVAL256Init
clean_module_constants
zend_get_compiled_variable_value
ftp_list
php_shutdown_info_logos
zend_check_private
zim_spl_SplFileObject_fseek
zend_do_init_array
zif_prev
php_url_encode
zif_readline_list_history
_php_stream_flush
zend_update_property_long
zend_update_property
zif_unixtojd
zif_set_time_limit
zend_object_std_init
PHP_RIPEMD320Init
zif_ob_implicit_flush
zim_spl_CachingIterator_getFlags
zim_spl_RecursiveDirectoryIterator_rewind
zim_reflection_method___construct
php_raw_url_encode
zim_spl_AppendIterator_valid
zend_prepare_string_for_scanning
pcre_get_compiled_regex_ex
spl_build_class_list_string
zend_copy_constants
php_if_tmpfile
zend_activate
zif_sys_getloadavg
spl_ce_RecursiveFilterIterator
_zend_hash_init
zend_objects_free_object_storage
zend_do_boolean_or_end
_php_math_zvaltobase
zif_is_uploaded_file
php_output_startup
zend_strtod
php_filter_float
zend_get_hash_value
zim_error_exception___construct
PHP_5HAVAL224Init
zim_reflection_property_getName
zif_fnmatch
zif_getprotobynumber
zend_ts_hash_merge
zm_deactivate_pcntl
zif_log
php_array_merge
php_SSL_new_from_context
zif_openssl_x509_export_to_file
_xml_notationDeclHandler
zif_xml_set_processing_instruction_handler
php_XML_ParserCreateNS
destroy_zend_function
zif_is_writable
sapi_get_request_time
zif_fgetc
zim_reflection_property_getValue
zim_spl_SimpleXMLIterator_getChildren
zend_dynamic_array_get_element
zif_dirname
php_print_info_htmlhead
zif_explode
zm_startup_user_streams
zim_spl_SplFileInfo_setInfoClass
php_stream_bucket_delref
zim_reflection_class_getEndLine
zim_spl_SplFileObject___construct
zend_objects_store_del_ref
zend_get_property_info
reflection_parameter_ptr
zend_ini_global_shutdown
zif_debug_zval_dump
zif_is_link
ps_open_files
php_session_start
zif_gmmktime
zm_startup_regex
zif_array_unique
realpath_cache_del
zif_natcasesort
sapi_get_target_uid
zif_socket_send
zif_readlink
php_flock
php_stream_socket_ops
php_if_readdir
zim_spl_EmptyIterator_next
zif_utf8_decode
php_network_bind_socket_to_local_addr
zend_declare_class_constant_stringl
zend_ptr_stack_destroy
zend_register_default_classes
zm_startup_hash
zif_readline_add_history
php_set_error_handling
zend_copy_parameters_array
reflection_object_ptr
php_filter_boolean
sapi_getenv
spl_handler_ArrayIterator
zif_xml_set_notation_decl_handler
zif_ob_flush
zend_do_binary_op
spl_ce_SplSubject
_xml_startElementHandler
ini_in
_php_stream_fopen_from_file
zif_gmp_jacobi
zend_llist_apply_with_arguments
php_unregister_info_logo
ps_read_user
zim_exception___clone
zim_spl_Array_next
zend_register_extension
zend_fcall_info_args_clear
zim_spl_RecursiveIteratorIterator___construct
zif_rewinddir
php_stream_rfc2397_wrapper
ini_parse
PHP_MD4Update
ini_out
zend_do_end_new_object
xml_globals
zim_reflection_extension_getName
mon_short_names
zend_hash_minmax
PHP_TIGERUpdate
zif_http_build_query
_php_stream_fopen_from_fd
zend_parse_parameters
php_shutdown_stream_wrappers
zif_preg_replace
_php_stream_filter_flush
zend_do_first_catch
timelib_days_in_month
zend_do_new_list_end
php_init_config
sapi_initialize_empty_request
zif_disk_total_space
zif_getopt
zim_spl_Array_natcasesort
timelib_error_container_dtor
zif_openssl_pkcs7_sign
zif_gmp_or
get_unary_op
zif_rawurlencode
php_default_output_func
zif_jdtounix
zend_register_interfaces
php_strtolower
zend_ce_arrayaccess
php_explode_negative_limit
zif_openssl_public_decrypt
zim_spl_LimitIterator_seek
zif_ksort
PHP_TIGER128Final
destroy_uploaded_files_hash
add_property_null_ex
zm_activate_pcntl
zend_set_memory_limit
zim_spl_Array_setIteratorClass
PHP_SHA256Init
zend_deactivate_modules
zif_array_uintersect_assoc
zif_openssl_pkey_export_to_file
zend_interface_iterator_funcs_iterator
shmop_functions
_php_stream_memory_get_buffer
zend_objects_store_init
php_date_global_timezone_db_enabled
zend_update_static_property_stringl
zend_do_begin_silence
spl_ce_RecursiveIteratorIterator
zim_spl_CachingIterator_rewind
zif_readline_callback_read_char
zif_substr_count
zif_iconv_set_encoding
_php_stream_get_line
php_stream_filter_append_ex
zim_spl_Array_setFlags
php_addslashes_ex
_zend_list_find
ini_lex
zim_spl_RecursiveIteratorIterator_endIteration
zend_std_get_constructor
zif_frenchtojd
zif_linkinfo
php_ini_opened_path
multi_convert_to_long_ex
php_hash_5haval128_ops
zim_reflection_extension_getConstants
add_next_index_zval
zend_std_read_property
zend_hash_rehash
cli_code_completion
timelib_time_ctor
zim_spl_RecursiveIteratorIterator_rewind
php_sig_png
spl_instantiate
zif_settype
zif_chmod
php_stream_xport_bind
zif_passthru
language_scanner_globals
php_filter_unsafe_raw
zif_next
zif_strtoupper
zend_llist_del_element
php_info_print_box_start
zif_addcslashes
sapi_module
php_str_to_str_ex
zend_html_putc
fetch_simple_variable
spl_ce_RecursiveDirectoryIterator
zif_array_values
zif_openssl_x509_free
zif_strcoll
php_stream_generic_socket_factory
zend_flush_buffer
zend_do_ticks
_php_stream_readdir
zif_gmp_random
zif_gmp_legendre
zif_php_ini_loaded_file
zim_spl_Array_getIterator
zif_sha1
iconv_module_entry
zif_readline_callback_handler_install
zim_reflection_function_returnsReference
zim_spl_SimpleXMLIterator_hasChildren
php_info_print_table_row_ex
zend_std_unset_static_property
zend_std_read_dimension
zif_array_change_key_case
zend_fcall_info_init
xml_utf8_decode
zif_jddayofweek
zend_init_rsrc_plist
_xml_zval_strdup
zend_do_brk_cont
zend_print_flat_zval_r
zif_stream_context_set_params
php_base64_encode
zend_check_property_access
php_stream_bucket_make_writeable
zend_get_parameters_ex
tsrm_strtok_r
_php_stream_memory_open
zim_reflection_method_isPrivate
PHP_CRC32Init
zif_bindtextdomain
zif_convert_uudecode
zim_spl_SplFileObject_fscanf
get_next_op_number
PHP_ADLER32Final
php_info_print_box_end
zim_spl_SplFileObject_fstat
zif_iptcembed
zif_socket_connect
zend_ini_scanner_get_lineno
zm_activate_spl
fourth_arg_force_ref
OnUpdateLongGEZero
zif_stripslashes
zif_is_float
spl_ce_SplFileInfo
php_init_info_logos
zif_str_replace
zif_cos
zend_do_fetch_constant
zend_throw_error_exception
zend_set_user_opcode_handler
zim_reflection_property_setValue
zend_parse_ini_string
zif_openssl_sign
zif_ftp_get
zend_eval_string_ex
zif_php_real_logo_guid
php_rand
zif_shmop_write
zif_ob_end_clean
zend_execute_scripts
timelib_isoweek_from_date
zm_shutdown_syslog
_safe_emalloc
php_XML_SetNotationDeclHandler
zend_print_zval_r_ex
PHP_RIPEMD128Final
zend_register_resource
virtual_chown
clean_non_persistent_constants
php_char_to_str_ex
php_info_logos
zif_atan2
zend_fcall_info_args_restore
zif_xml_set_start_namespace_decl_handler
php_register_variable_safe
php_stream_context_set_link
zend_do_add_list_element
php_check_specific_open_basedir
zend_ts_hash_apply_with_argument
zend_shutdown
zend_do_fetch_property
zend_do_switch_end
zend_do_for_before_statement
php_libxml_decrement_node_ptr
zend_call_method
zif_fpassthru
zif_strrev
spl_object_storage_contains
zif_getdir
zim_spl_SplFileObject_setFlags
zif_ob_get_level
zif_dns_get_mx
zm_startup_sockets
php_raw_url_decode
zend_declare_class_constant_null
zend_do_case_after_statement
zm_info_spl
zim_reflection_export
zend_register_iterator_wrapper
zim_spl_CachingIterator___toString
main_cwd_state
zend_register_list_destructors_ex
zif_fclose
zm_startup_exif
zim_reflection_object___construct
zend_hash_merge_ex
zif_register_shutdown_function
PHP_MD2Init
zend_get_class_entry
zval_add_ref
zim_reflection_property_isStatic
module_registry_request_startup
php_openssl_ssl_socket_factory
zif_acosh
php_openssl_get_x509_list_id
OnUpdateBool
zend_append_version_info
zm_info_hash
zend_do_declare_end
zend_ts_hash_compare
hash_module_entry
zend_qsort
_php_stream_mmap_unmap
PHP_5HAVAL128Init
sapi_send_headers
zend_ini_scanner_get_filename
zim_spl_dual_it_rewind
_php_stream_memory_create
zim_spl_SplFileInfo_getPathname
spl_ce_Countable
zif_cal_days_in_month
zm_startup_simplexml
add_property_long_ex
PHP_3TIGERInit
zend_register_module_ex
zif_getmypid
zim_spl_FilterIterator_rewind
zif_readline_redisplay
zif_dcgettext
zif_gmp_mul
zend_mm_startup
zim_spl_FilterIterator___construct
zif_pcntl_exec
FrenchMonthName
shift_left_function
zif_iterator_to_array
zif_is_resource
zif_ob_get_length
zif_exif_read_data
zif_is_numeric
zend_ts_hash_index_find
php_filter_validate_ip
zend_is_compiling
zend_do_new_list_begin
zm_deactivate_filestat
timelib_date_to_int
is_smaller_or_equal_function
zif_uniqid
zif_round
zim_reflection_property___toString
zend_do_list_end
php_le_stream_context
zend_str_tolower
_php_stream_alloc
php_addcslashes
PHP_WHIRLPOOLInit
zif_strrpos
zif_gmp_fact
zend_is_callable
_php_stream_bz2open_from_BZFILE
zend_read_property
sapi_register_treat_data
zval_used_for_init
php_stream_context_free
php_libxml_import_node
zend_do_pass_param
convert_scalar_to_number
zend_ts_hash_del_key_or_index
zif_ip2long
machine_little_endian
_efree
PHP_HAVAL160Final
do_bind_function
zend_message_dispatcher
zif_asort
le_index_ptr
zend_objects_store_mark_destructed
ps_delete_user
zif_filter_has_var
add_assoc_stringl_ex
zim_spl_Array_valid
PHP_TIGER160Final
zif_xml_set_external_entity_ref_handler
ps_delete_files
zif_strpos
zif_php_ini_scanned_files
zend_binary_zval_strcasecmp
timelib_unixtime2local
zim_reflection_parameter_getPosition
zim_spl_AppendIterator_getArrayIterator
virtual_utime
php_hash_hashtable
zm_deactivate_url_scanner_ex
zim_reflection_class_implementsInterface
zif_stream_get_filters
zif_openssl_pkcs12_read
zend_do_fetch_global_variable
zif_copy
zm_startup_xml
module_destructor
zif_openssl_csr_new
zif_setrawcookie
copy_zend_constant
_zend_bailout
php_url_scanner_add_var
PHP_RIPEMD256Init
zim_reflection_method_isStatic
php_any_addr
zend_ptr_stack_apply
zif_gmp_gcdext
php_XML_SetProcessingInstructionHandler
php_libxml_initialize
zif_gethostbyname
zim_spl_SplObjectStorage_attach
php_gettext_functions
php_execute_simple_script
php_libxml_ctx_warning
php_stream_xport_accept
php_setup_sapi_content_types
zif_uksort
_xml_startNamespaceDeclHandler
sapi_register_input_filter
_php_stream_rmdir
zif_hash_file
zif_getdate
_php_stream_filter_append
PHP_ADLER32Update
zif_jewishtojd
zm_startup_spl_observer
zend_fetch_class
zend_user_unserialize
zim_spl_SplFileInfo_getGroup
zif_cosh
php_pcre_split_impl
_xml_endNamespaceDeclHandler
zif_is_string
zim_spl_SplFileInfo_getType
php_sxe_iterator_funcs
zif_mt_getrandmax
PHP_RIPEMD160Update
zif_stream_socket_server
php_stream_context_del_link
zif_pcntl_wstopsig
zif_openlog
zif_strptime
zm_startup_user_filters
php_uudecode
reflection_property_ptr
zif_gmp_gcd
spl_handler_SplObjectStorage
zend_do_assign
zm_deactivate_streams
zend_update_property_stringl
zim_reflection_class_isUserDefined
php_date_full_day_name
zend_print_zval_ex
second_arg_force_ref
zend_timeout
zif_get_headers
zend_hash_copy
zend_fatal_scanner_error
zim_reflection_function_getStartLine
zm_deactivate_date
zif_openssl_pkey_free
zif_date_time_set
sockets_functions
php_filter_email
php_hash_environment
zend_register_double_constant
zif_fgets
PHP_3HAVAL160Init
consumed_filter_factory
php_stream_bucket_unlink
zif_assert_options
php_call_shutdown_functions
timelib_set_timezone
zif_filetype
zim_spl_DirectoryIterator_isDot
readline_module_entry
zif_timezone_offset_get
zif_preg_split
PHP_5HAVAL192Init
PHP_MD2Final
php_socket_strerror
zend_ts_hash_exists
zim_spl_SimpleXMLIterator_rewind
zif_pi
zm_shutdown_array
zif_stream_socket_shutdown
PHP_RIPEMD256Final
zend_declare_property_bool
module_registry
zend_ts_hash_apply
exif_globals
zif_wordwrap
php_zlib_filter_factory
add_assoc_long_ex
php_filter_url
zend_do_return
php_XML_GetCurrentByteIndex
php_stream_input_ops
spl_register_functions
zif_asin
php_register_internal_extensions
zif_php_logo_guid
zend_shutdown_constants
zm_startup_dns
zim_reflection_parameter_isOptional
zend_do_inherit_interfaces
bz2_module_entry
zif_getservbyport
php_default_input_filter
zim_spl_SplFileInfo_isExecutable
zif_readfile
zend_update_static_property_string
zif_array_rand
php_request_shutdown
zend_object_store_set_object
zend_ticks_function
php_libxml_issue_error
zend_atoi
php_sxe_get_iterator
_php_import_environment_variables
zend_ptr_stack_num_elements
date_module_entry
shmop_module_entry
php_stream_open_for_zend_ex
zif_crypt
add_get_index_stringl
zif_metaphone
zif_similar_text
zend_do_binary_assign_op
php_libxml_increment_doc_ref
zif_timezone_abbreviations_list
pcre_globals
php_hash_sha1_ops
_php_stream_fopen_temporary_file
zim_spl_SplObjectStorage_next
zif_socket_getsockname
spl_append_it_fetch
zim_spl_RecursiveDirectoryIterator_hasChildren
zend_ce_aggregate
zend_update_static_property_null
zim_spl_SplObjectStorage_unserialize
php_addslashes
php_ub_body_write
zif_strftime
php_get_uname
zif_gmp_sign
zend_declare_property_ex
zend_rsrc_list_get_rsrc_type
zif_filemtime
zif_extract
zif_openssl_csr_get_subject
zim_spl_RecursiveDirectoryIterator_next
php_end_ob_buffers
php_image_type_to_mime_type
zif_unlink
php_get_output_start_lineno
zend_get_constant
zim_spl_SplFileInfo_isDir
zend_hash_sort
zim_spl_Array_natsort
php_info_print_table_colspan_header
spl_ce_EmptyIterator
zif_sql_regcase
sapi_get_default_content_type
session_module_entry
php_filter_validate_url
zend_update_static_property_bool
zif_array_map
virtual_cwd_startup
zif_is_null
zend_do_post_incdec
module_registry_unload_temp
strnatcmp_ex
zend_register_internal_interface
zif_gethostbynamel
zif_gmp_div_r
spl_ce_OuterIterator
mul_function
zim_spl_FilterIterator_next
zend_standard_class_def
zend_stream_ferror
zif_array_diff_assoc
PHP_4HAVAL224Init
sapi_register_post_entry
zim_reflection_function_isInternal
zend_hash_get_current_key_ex
zif_stream_filter_append
zif_spl_autoload_unregister
spl_array_get_iterator
zif_headers_sent
date_functions
php_register_variable_ex
zend_llist_get_first_ex
zif_proc_get_status
spl_ce_ArrayObject
zend_register_internal_module
zim_spl_dual_it_current
spl_functions
sapi_shutdown
zend_register_stringl_constant
_php_stream_stat
zif_stream_get_wrappers
zif_gmp_popcount
zim_spl_RecursiveIteratorIterator_getMaxDepth
php_register_extensions
_safe_realloc
zif_hash_algos
php_module_shutdown_wrapper
zim_spl_ParentIterator___construct
php_stream_display_wrapper_errors
zif_fgetcsv
zif_date_timezone_set
php_hash_crc32b_ops
zif_is_scalar
gmp_functions
zim_reflection_parameter_allowsNull
sapi_apply_default_charset
zif_gmp_init
zim_spl_SplFileInfo_isLink
zif_log10
zif_array_reverse
zim_reflection_method_invoke
zend_do_unset
zif_ob_get_contents
zif_ftell
zim_spl_InfiniteIterator_next
make_digest
zim_spl_RecursiveIteratorIterator_callGetChildren
zend_do_while_end
zend_error_cb
zend_ini_long
zif_openssl_private_encrypt
zif_ob_get_status
zif_lchgrp
sapi_handle_post
ap_php_slprintf
zend_do_begin_variable_parse
zif_time
zval_update_constant_inline_change
zif_socket_strerror
zif_strripos
spl_ce_OverflowException
zif_gmp_cmp
php_stat
zif_closedir
zif_readline_on_new_line
zif_strspn
zif_unregister_tick_function
zim_spl_SplObjectStorage_detach
php_hash_sha256_ops
_php_stream_open_wrapper_ex
zim_spl_DirectoryIterator_key
php_hash_md5_ops
zif_stream_socket_recvfrom
zim_spl_dual_it_getInnerIterator
data_writeable
zif_stream_select
zend_hash_del_key_or_index
zif_getmyinode
zend_do_exit
zim_reflection_class_getConstructor
zif_readline_completion_function
_php_math_longtobase
zif_ftp_rawlist
zim_spl_SplFileObject_eof
zif_xml_parse_into_struct
php_get_inf
zim_reflection_class_isInternal
zm_startup_openssl
php_fopen_primary_script
php_XML_ParserCreate
zend_initialize_try_catch_element
zend_do_end_silence
instanceof_function_ex
zif_eregi
zif_gmp_and
_xml_endElementHandler
zim_reflection_class_isFinal
php_getgid
zend_binary_strcasecmp
sapi_register_default_post_reader
zend_ini_get_var
zend_switch_to_buffer
pcre_get_compiled_regex
php_if_fstat
zif_jdtofrench
tsrm_realpath
fetch_array_begin
php_splice
zim_reflection_parameter_isDefaultValueAvailable
_zend_mm_block_size
zif_gmp_abs
zif_date_sunrise
PHP_HAVALUpdate
zend_extension_dispatch_message
php_hash_3haval256_ops
php_sprintf
zend_objects_store_free_object_storage
zif_socket_create_listen
php_sig_gif
php_stream_url_wrap_ftp
zend_user_serialize
zend_user_it_get_new_iterator
openssl_module_entry
_safe_malloc
zif_disk_free_space
PHP_GOSTUpdate
zim_reflection_function_isDisabled
_php_stream_copy_to_mem
zend_get_compiled_variable_name
ps_srlzr_encode_php
zif_gmp_xor
zif_fileperms
zend_hash_update_current_key_ex
zend_ts_hash_copy
zif_dns_check_record
DayOfWeek
php_ob_gzhandler_check
zif_sort
zim_error_exception_getSeverity
zend_get_zval_ptr_ptr
add_assoc_double_ex
OnUpdateStringUnempty
php_XML_SetElementHandler
zif_shmop_read
zif_floor
zif_readline_info
php_hash_sha384_ops
ap_php_conv_p2
zim_reflection_class_getDefaultProperties
xml_utf8_encode
zif_ftp_fput
zend_ce_serializable
php_add_tick_function
zend_stack_init
zif_parse_ini_file
zif_stream_context_set_option
_php_stream_getc
php_url_parse
zim_spl_SplObjectStorage_valid
zim_reflection_parameter___construct
start_memory_manager
zif_array_pop
zif_rmdir
day_short_names
zend_do_add_static_array_element
zend_llist_copy
zim_reflection_extension_info
zif_flush
php_startup_auto_globals
sapi_activate
zif_error_get_last
zif_socket_set_nonblock
basic_functions
php_filter_magic_quotes
zif_clearstatcache
zif_xml_get_current_line_number
zim_spl_AppendIterator_getIteratorIndex
zend_cleanup_function_data_full
spl_ce_LimitIterator
zend_ts_hash_sort
zif_feof
zend_stack_int_top
php_strlcpy
localeconv_r
zend_objects_store_destroy
php_start_ob_buffer
zim_reflection_property_getDeclaringClass
zm_startup_standard_filters
zend_set_compiled_filename
zif_date_default_timezone_get
get_next_brk_cont_element
zif_xml_parser_set_option
zif_atan
sapi_read_standard_form_data
zend_is_executing
add_property_resource_ex
php_stream_xport_crypto_setup
zend_do_begin_function_call
zif_filter_id
zend_llist_add_element
zif_putenv
php_register_url_stream_wrapper_volatile
zim_reflection_function_getNumberOfParameters
get_next_op
add_get_assoc_stringl_ex
add_assoc_resource_ex
ps_write_user
php_if_iconv
zlib_globals
zif_fmod
php_print_credits
zim_spl_RecursiveFilterIterator_getChildren
zm_startup_basic
zim_reflection_property_getModifiers
pcntl_functions
zif_date_format
zend_do_default_before_statement
zif_socket_get_option
php_ob_set_internal_handler
zend_declare_class_constant
zend_do_begin_new_object
zif_stream_socket_enable_crypto
zend_do_fetch_static_variable
zim_simplexml_element___construct
php_add_session_var
zif_stream_filter_prepend
php_register_info_logo
zif_ucwords
_zend_hash_merge
empty_fcall_info_cache
php_XML_ErrorString
php_stream_url_wrap_php
zm_deactivate_gmp
php_ob_init_conflict
zend_do_switch_cond
core_globals
_php_stream_open_wrapper_as_file
zend_user_it_move_forward
zend_compare_file_handles
php_sig_iff
zend_ptr_stack_clean
zif_eregi_replace
zm_startup_readline
zm_startup_ftp
zend_do_abstract_method
PHP_SHA512Init
sockets_module_entry
php_sig_tif_mm
spl_ce_RecursiveIterator
_zend_mm_realloc
zim_spl_Array_offsetExists
php_version_compare
spl_ce_SplObjectStorage
zif_openssl_x509_read
zend_hash_apply_with_arguments
date_funcs_timezone
zif_utf8_encode
zm_shutdown_filter
ValidateFormat
zif_deg2rad
_php_stream_sock_open_from_socket
php_var_export
spl_ce_ArrayIterator
zif_ob_iconv_handler
php_network_get_sock_name
zif_date_timezone_get
fifth_arg_force_ref
zim_spl_Array_uksort
zif_preg_grep
zend_hex_strtod
php_info_html_esc_write
zif_php_strip_whitespace
zim_spl_EmptyIterator_current
php_network_get_peer_name
_php_error_log_ex
ps_srlzr_decode_php
php_stream_xport_get_hash
zend_register_internal_class_ex
zim_reflection_class_getInterfaceNames
zim_spl_Array_key
zif_filter_var
php_ini_register_extensions
default_exception_ce
gmp_module_entry
zend_list_insert
zend_llist_apply_with_argument
zif_key
zend_declare_property_stringl
zif_simplexml_load_file
php_hash_ripemd160_ops
zif_stripcslashes
zim_reflection_class_getMethods
zend_throw_exception
ps_write_files
zend_startup_extensions_mechanism
zif_filter_list
zim_reflection_class_newInstanceArgs
zendparse
_php_stream_passthru
zim_spl_SplFileObject_key
php_XML_ParserFree
timelib_day_of_week
display_ini_entries
zif_array_key_exists
zend_register_list_destructors
php_stream_wrapper_log_error
zend_throw_exception_hook
zend_register_auto_global
ini__scan_bytes
php_stream_http_wrapper
zend_user_it_get_current_data
PHP_5HAVAL160Init
zend_funcs_serializable
zif_arsort
GLIBC_2.0
GLIBC_2.1
GLIBC_2.2
GLIBC_2.2.3
GLIBC_2.4
GLIBC_2.3
GLIBC_2.3.4
A8kQD<
G8kWD<)
G8kWD<)
</wN<,
<Et	<e
<,vT<-
</v5<5
<Ot	<o
<5v"<9
< t"<.
<Uw!<9
<MwR<)
<_wa<E
<Mwk<-wM<)
<_wL<N
<KwM<-w/<)
<mwR<`
<_wS<L
<SwH<-w.<)
</vU<9
<3tH<9
<HwK<-w-<)
<_wg<I
<hw"<`
<2vl<3
<`w\<Z
<_wc<R
<-w:<)
<qv\<r
<RwC<-w)<)
<_wr<D
<rw,<`
<Cwk<-wM<)
<@w%<)
<xw2<Z
<`w,<Z
<ZwR</
<lwL<k
<)w!<(
<Dw_<)w
<)w><(
<xw2<Z
<`w,<Z
<5vw<9
<2wP</
<rw+<q
<mw:<Z
<Cw"<-
<@w(<,v
<Xwj<-wL<)
<_wB<Y
<-wi<)
<ytR<z
<_w\<L
<kw2<`
<_w,<S
<CwW<-w=<)
<cw(<`
<ewC<`
<@wb<,vN<.
<-wj<)
<`wl<Z
<,vy<.
<GwX<,vD<.
<_wr<R
<KwV<)w$<(
<Dw}<)w/<(
<Xw_<)
<cw2<Z
<Swh<-wI<)
<GwA<-w'<)
<_wR<K
<Lw`<-wF<)
<Cwq<-wW<)
<lw,<`
<Awa<-wG<)
<@wk<,vW<.
<_w<<A
<XwX<,vE<.
<DwX<,vD<.
<.wr<-
<rw|<`
<Swk<-wN<)
<Xwr<-wT<)
<_wb<T
<_w<<Y
<5v><6
<Uw:<I
<Yw@<RtM<X
<-t$</
<nwN<T
<qwg<n
</v!<5w
<nwV</
<nw&</
<nvf<r
<2wj</
<nwX<Tt&<m
<1vU<2t$<9
<rw}<qw
<5v2<9
<9v3<:
<,v6<-t:</
<2tw<9wC
<0t(<4
<Uw6<PtB<T
<Nwd<Ltq<M
<YwK<RtS<X
<lwG<k
<rw4<q
<Awz<)
<Yw@<)
<@wX<,vD<.
w&<MuU
<)v$<@
ws<)w5<(
<Dwm<)
<mwb<Z
<Ew?<A
<)w+<(
<nwL<Z
<DwH<-w.<)
<dw,<`
<Rwk<-wM<)
<-ws<)
<_wR<Y
<gw\<`
<Cw;<,v'<.
<`wb<D
</w!<.
<0td<9
<Awp<-wN<)
<_wS<A
<Nwh<-wN<)
<Xwp<-wV<)
<nw,<`
<QwK<-w-<)
<ytR<z
<_wL<R
</w=<,v*<.
<qwB<`
<^vS<_
<QwH<-w.<)
<aw<<`
<Dwa<-wG<)
<Nwk<,vW<.
<`w2<O
<dww<`
<QwF<,v.<.
<Sw?<-w&<)
<_w2<H
</w8<(
v9<(v%<)
<`vq<m
<@w@<)
<`wL<P
<DwR<)
<MwK<-w-<)
<SwK<-w-<)
<_wR<T
<mwr<`
<Gw{<-w^<)
<Hwr<-wT<)
<_wb<H
<_w<<I
<Mwi<-wP<)
<,v`<.
</w[<,
<-w=<)
<_wR<R
<lw,<`
<Awa<-wG<)
<Xwk<,vW<.
<`w2<Y
<aw"<`
<sw,<`
<Gwk<-wM<)
<Rwj<-wM<)
<Qwh<,vT<.
<_wR<S
<-wp<)
<Uw:<PtF<T
<Yw@<Rt
<rw|<q
<NwZ<L
<sw+<`
<Fw{<-w]<)
<nwP<`
<Mwb<-wD<)
<_wS<N
<LwH<-w.<)
<CwK<-w-<)
<lwR<`
<_wS<D
<AwB<,v.<.
<`w,<B
<Iw.<)
<5vW<6
<`vq<m
<_w"<V
<DwH<-w.<)
<-w3<)
<(w<<'
<mwC<`
<Cwh<-wN<)
<,vp<.
<cw,<`
<@w[<,vG<.
<Qwa<-wG<)
</w3<.
<qwl<`
<`w,<Z
<-wi<)
<_w}<T
<sw1<`
<-w><)
<-t:<+t6
<\t^<$tZ
<\t1<$t-
F4<rta<wt]<atY<x
<rt^<wt}
B0ffff
B4ff9@
A0ffff
A4ff9@
B4MbP?
0<	w	1
gfff)M
@$g&3g
< t<<=
H(k@,L
<nt_<w
9P0}	1
</~L<9
</~j<9
</~u<9
</~p<9
</~Z<9
</~o<9
</~Z<9
</~q<9
</~q<9
</~\<9
</~x<9
</~q<9
<?t'<*
K<0tP<-tV<+
<xtS<XtO
<stv<r
< tk<	tg
t#<=th
< tE<	
< tO<	tK<
<lt|<Ltx<htt
<-t?<+t;
?:t&9}
<@we<:tm
q +79u
</~i<9
</~v<9
<.te</
tp<"t=<'t9
Fl;Fpt
Gp+Gl;E
Wp;Wlu
<.ty</
GD9G@|#
+G<+W<
A!:B!u
<jt[<B
P(k@,L
P(k@,L
p(k@,L
P(k@,L
FH<iu"9
Q(kA,L
B,9B0t-k
<-tR<+tN
BH<<t\<=tX<ItT
B ;B(t
B 9B(t
P(k@,L
<xt	<X
W kF@L
B kQ0L
B kW0L
B kW0L
</~s<9
</~r<9
x@=t	^
</~q<9
B kQ@L
B kQ0L
G kQ@L
G kQ0L
</~s<9
</~s<9
B kQ0L
x@=t	^
B kQ@L
B kQ0L
</~t<9
</~t<9
</~t<9
</~v<9
</~r<9
B kQ0L
B kQ@L
</~t<9
</~q<9
B kQ0L
B kQ0L
Timezone ID '%s' is invalid
timezone_id
%c%02d:%02d
Unknown or bad timezone (%s)
Unknown
GMT%c%02d%02d
%s%04lld
%c%02d%s%02d
minute
second
fraction
warning_count
warnings
error_count
is_localtime
zone_type
is_dst
tz_abbr
relative
date.timezone
no DST
transit
civil_twilight_begin
civil_twilight_end
nautical_twilight_begin
nautical_twilight_end
astronomical_twilight_begin
astronomical_twilight_end
l|ldddd
date.default_latitude
date.default_longitude
date.sunset_zenith
date.sunrise_zenith
invalid format
minutes
tm_sec
tm_min
tm_hour
tm_mday
tm_mon
tm_year
tm_wday
tm_yday
tm_isdst
|lllllll
@%ld UTC
idate format is one char
Y-m-d\TH:i:sO
date/time support
external
Timezone Database
Default timezone
Y-m-d\TH:i:sP
l, d-M-y H:i:s T
D, d M y H:i:s O
D, d M Y H:i:s O
DATE_ATOM
DATE_COOKIE
DATE_ISO8601
DATE_RFC822
DATE_RFC850
DATE_RFC1036
DATE_RFC1123
DATE_RFC2822
DATE_RFC3339
DATE_RSS
DATE_W3C
SUNFUNCS_RET_TIMESTAMP
SUNFUNCS_RET_STRING
SUNFUNCS_RET_DOUBLE
DateTimeZone
strtotime
gmdate
gmmktime
checkdate
gmstrftime
getdate
date_create
date_parse
date_format
date_modify
date_timezone_get
date_timezone_set
date_offset_get
date_time_set
date_date_set
date_isodate_set
timezone_open
timezone_name_get
timezone_name_from_abbr
timezone_offset_get
timezone_transitions_get
timezone_identifiers_list
timezone_abbreviations_list
date_default_timezone_set
date_default_timezone_get
date_sunrise
date_sunset
date_sun_info
__construct
getTimezone
setTimezone
getOffset
setTime
setDate
setISODate
getName
getTransitions
listAbbreviations
listIdentifiers
January
February
August
September
October
November
December
Sunday
Monday
Tuesday
Wednesday
Thursday
Friday
Saturday
31.7667
35.2333
90.583333
associative_array
timezone_identifier
gmt_offset
The DateTimeZone object has not been correctly initialized by its constructor
The DateTime object has not been correctly initialized by its constructor
Can only do this for zones with ID for now
Failed to parse time string (%s) at position %d (%c): %s
%04d-%02d-%02dT%02d:%02d:%02d%c%02d:%02d
%3s, %02d %3s %04d %02d:%02d:%02d %c%02d%02d
It is not safe to rely on the system's timezone settings. Please use the date.timezone setting, the TZ environment variable or the date_default_timezone_set() function. In case you used any of those methods and you are still getting this warning, you most likely misspelled the timezone identifier. We selected '%s' for '%s/%.1f/%s' instead
Timezone database is corrupt - this should *never* happen!
Wrong return format given, pick one of SUNFUNCS_RET_TIMESTAMP, SUNFUNCS_RET_STRING or SUNFUNCS_RET_DOUBLE
You should be using the time() function instead
The is_dst parameter is deprecated
Unrecognized date format token.
"Olson" Timezone Database Version
up7@9EGr
Empty string
Double timezone specification
Unexpected character
Double date specification
Double time specification
America/Porto_Acre
America/Eirunepe
America/Rio_Branco
Brazil/Acre
America/Goose_Bay
America/Pangnirtung
Africa/Addis_Ababa
Africa/Asmara
Africa/Asmera
America/Halifax
America/Barbados
America/Blanc-Sablon
America/Glace_Bay
America/Martinique
America/Moncton
America/Thule
Atlantic/Bermuda
Canada/Atlantic
Asia/Baghdad
Asia/Kabul
America/Anchorage
US/Alaska
America/Adak
America/Atka
US/Aleutian
America/Juneau
America/Nome
America/Yakutat
Asia/Aqtobe
Asia/Almaty
Asia/Yerevan
America/Boa_Vista
America/Campo_Grande
America/Cuiaba
America/Manaus
America/Porto_Velho
America/Santarem
Brazil/West
America/Asuncion
Europe/Amsterdam
Europe/Athens
Asia/Anadyr
America/Curacao
America/Aruba
Africa/Luanda
America/Puerto_Rico
Asia/Aqtau
America/Buenos_Aires
America/Argentina/Catamarca
America/Argentina/Cordoba
America/Argentina/Jujuy
America/Argentina/La_Rioja
America/Argentina/Mendoza
America/Argentina/Salta
America/Argentina/San_Juan
America/Argentina/San_Luis
America/Argentina/Tucuman
America/Argentina/Ushuaia
America/Catamarca
America/Cordoba
America/Jujuy
America/Mendoza
America/Rosario
Antarctica/Palmer
Asia/Ashkhabad
Asia/Ashgabat
Asia/Riyadh
America/Anguilla
America/Antigua
America/Dominica
America/Grenada
America/Guadeloupe
America/Marigot
America/Miquelon
America/Montserrat
America/Port_of_Spain
America/Santo_Domingo
America/St_Barthelemy
America/St_Kitts
America/St_Lucia
America/St_Thomas
America/St_Vincent
America/Tortola
America/Virgin
Asia/Aden
Asia/Bahrain
Asia/Kuwait
Asia/Qatar
Atlantic/Azores
Asia/Baku
Europe/London
Asia/Dacca
Asia/Dhaka
Europe/Belfast
Europe/Gibraltar
Europe/Guernsey
Europe/Isle_of_Man
Europe/Jersey
GB-Eire
Africa/Mogadishu
Africa/Kampala
Africa/Nairobi
Africa/Dar_es_Salaam
America/Bogota
Africa/Banjul
Asia/Bangkok
Europe/Tiraspol
Europe/Bucharest
Europe/Chisinau
Asia/Brunei
bortst
Asia/Kuching
America/La_Paz
America/Sao_Paulo
America/Araguaina
America/Bahia
America/Belem
America/Fortaleza
America/Maceio
America/Recife
Brazil/East
Pacific/Midway
Pacific/Pago_Pago
Pacific/Samoa
US/Samoa
Europe/Dublin
Asia/Thimbu
Asia/Thimphu
Asia/Kolkata
Asia/Calcutta
Asia/Rangoon
Atlantic/Canary
Australia/Adelaide
Africa/Gaborone
Africa/Khartoum
Antarctica/Casey
Africa/Blantyre
Africa/Bujumbura
Africa/Harare
Africa/Kigali
Africa/Lubumbashi
Africa/Lusaka
Africa/Maputo
Africa/Windhoek
Indian/Cocos
America/Rankin_Inlet
America/Resolute
America/Chicago
America/Havana
America/Atikokan
America/Belize
America/Cambridge_Bay
America/Cancun
America/Chihuahua
America/Coral_Harbour
America/Costa_Rica
America/El_Salvador
America/Fort_Wayne
America/Guatemala
America/Indiana/Indianapolis
America/Indiana/Knox
America/Indiana/Marengo
America/Indiana/Petersburg
America/Indiana/Tell_City
America/Indiana/Vevay
America/Indiana/Vincennes
America/Indiana/Winamac
America/Indianapolis
America/Iqaluit
America/Kentucky/Louisville
America/Kentucky/Monticello
America/Knox_IN
America/Louisville
America/Managua
America/Matamoros
America/Menominee
America/Merida
America/Mexico_City
America/Monterrey
America/North_Dakota/Center
America/Ojinaga
America/Rainy_River
America/Tegucigalpa
America/Winnipeg
Canada/Central
CST6CDT
Mexico/General
US/Central
US/East-Indiana
US/Indiana-Starke
Asia/Shanghai
Asia/Chongqing
Asia/Chungking
Asia/Harbin
Asia/Kashgar
Asia/Taipei
Asia/Urumqi
Europe/Berlin
Europe/Kaliningrad
Africa/Algiers
Africa/Ceuta
Africa/Tripoli
Africa/Tunis
Arctic/Longyearbyen
Atlantic/Jan_Mayen
Europe/Andorra
Europe/Belgrade
Europe/Bratislava
Europe/Brussels
Europe/Budapest
Europe/Copenhagen
Europe/Kiev
Europe/Lisbon
Europe/Ljubljana
Europe/Luxembourg
Europe/Madrid
Europe/Malta
Europe/Minsk
Europe/Monaco
Europe/Oslo
Europe/Paris
Europe/Podgorica
Europe/Prague
Europe/Riga
Europe/Rome
Europe/San_Marino
Europe/Sarajevo
Europe/Simferopol
Europe/Skopje
Europe/Sofia
Europe/Stockholm
Europe/Tallinn
Europe/Tirane
Europe/Uzhgorod
Europe/Vaduz
Europe/Vatican
Europe/Vienna
Europe/Vilnius
Europe/Warsaw
Europe/Zagreb
Europe/Zaporozhye
Europe/Zurich
Poland
Portugal
Africa/Casablanca
America/Scoresbysund
Pacific/Chatham
NZ-CHAT
Asia/Choibalsan
Asia/Dili
Asia/Makassar
Asia/Pontianak
Asia/Ujung_Pandang
Asia/Sakhalin
Asia/Tokyo
Pacific/Rarotonga
America/Santiago
Chile/Continental
America/Caracas
America/Panama
America/Detroit
America/Hermosillo
America/Mazatlan
America/Regina
America/Swift_Current
America/Thunder_Bay
Canada/East-Saskatchewan
Canada/Saskatchewan
Mexico/BajaSur
US/Michigan
Asia/Macao
Asia/Macau
Asia/Jayapura
Australia/Broken_Hill
Australia/Darwin
Australia/North
Australia/South
Australia/Yancowinna
Atlantic/Cape_Verde
Australia/Eucla
Indian/Christmas
Pacific/Guam
Pacific/Saipan
Antarctica/Davis
Antarctica/DumontDUrville
Asia/Dushanbe
Chile/EasterIsland
Pacific/Easter
Indian/Antananarivo
Africa/Djibouti
Indian/Comoro
Indian/Mayotte
America/Guayaquil
Pacific/Galapagos
America/New_York
America/Grand_Turk
America/Jamaica
America/Montreal
America/Nassau
America/Nipigon
America/Port-au-Prince
America/Toronto
Canada/Eastern
EST5EDT
US/Eastern
Europe/Helsinki
Africa/Cairo
Asia/Amman
Asia/Beirut
Asia/Damascus
Asia/Gaza
Asia/Istanbul
Asia/Nicosia
Europe/Istanbul
Europe/Mariehamn
Europe/Moscow
Europe/Nicosia
Turkey
America/Cayman
Australia/ACT
Australia/Brisbane
Australia/Canberra
Australia/Currie
Australia/Hobart
Australia/LHI
Australia/Lindeman
Australia/Lord_Howe
Australia/Melbourne
Australia/NSW
Australia/Queensland
Australia/Sydney
Australia/Tasmania
Australia/Victoria
Pacific/Fiji
Atlantic/Stanley
Africa/Freetown
Atlantic/Madeira
America/Noronha
Brazil/DeNoronha
Asia/Bishkek
Pacific/Gambier
America/Guyana
Asia/Tbilisi
America/Cayenne
Africa/Accra
Pacific/Tarawa
gmt+10
Etc/GMT+10
gmt+11
Etc/GMT+11
gmt+12
Etc/GMT+12
Etc/GMT+1
Etc/GMT+2
Etc/GMT+3
Etc/GMT+4
Etc/GMT+5
Etc/GMT+6
Etc/GMT+7
Etc/GMT+8
Etc/GMT+9
gmt-10
Etc/GMT-10
gmt-11
Etc/GMT-11
gmt-12
Etc/GMT-12
gmt-13
Etc/GMT-13
gmt-14
Etc/GMT-14
Etc/GMT-1
Etc/GMT-2
Etc/GMT-3
Etc/GMT-4
Etc/GMT-5
Etc/GMT-6
Etc/GMT-7
Etc/GMT-8
Etc/GMT-9
Africa/Abidjan
Africa/Bamako
Africa/Bissau
Africa/Conakry
Africa/Dakar
Africa/Lome
Africa/Malabo
Africa/Monrovia
Africa/Niamey
Africa/Nouakchott
Africa/Ouagadougou
Africa/Porto-Novo
Africa/Sao_Tome
Africa/Timbuktu
America/Danmarkshavn
Atlantic/Reykjavik
Atlantic/St_Helena
Etc/GMT
Etc/GMT+0
Etc/GMT-0
Etc/GMT0
Etc/Greenwich
Iceland
Asia/Dubai
Atlantic/South_Georgia
Asia/Muscat
Pacific/Honolulu
US/Hawaii
Asia/Hong_Kong
Hongkong
Asia/Hovd
Pacific/Johnston
Asia/Ho_Chi_Minh
Asia/Phnom_Penh
Asia/Saigon
Asia/Vientiane
Asia/Jerusalem
Asia/Tel_Aviv
Israel
Asia/Colombo
Asia/Irkutsk
Indian/Chagos
Asia/Tehran
Asia/Karachi
Asia/Kathmandu
Asia/Katmandu
Asia/Jakarta
Asia/Kuala_Lumpur
Asia/Manila
Asia/Singapore
Pacific/Nauru
Asia/Seoul
Asia/Qyzylorda
Pacific/Kosrae
Asia/Krasnoyarsk
Asia/Novokuznetsk
Asia/Pyongyang
Europe/Samara
Pacific/Kwajalein
Pacific/Kiritimati
America/Godthab
America/Paramaribo
Atlantic/Faeroe
Atlantic/Faroe
America/Lima
America/Edmonton
Canada/Mountain
America/Santa_Isabel
America/Ensenada
America/Tijuana
Mexico/BajaNorte
Africa/El_Aaiun
Pacific/Marquesas
Pacific/Tahiti
Pacific/Apia
Europe/Volgograd
Asia/Oral
Indian/Mahe
Indian/Reunion
Indian/Mauritius
Asia/Yekaterinburg
Asia/Samarkand
Asia/Tashkent
Asia/Omsk
Asia/Novosibirsk
Africa/Libreville
Africa/Douala
Asia/Ulaanbaatar
Asia/Ulan_Bator
Asia/Yakutsk
Asia/Vladivostok
Africa/Ndjamena
Asia/Magadan
Africa/Brazzaville
Asia/Kamchatka
Pacific/Guadalcanal
Pacific/Noumea
Pacific/Efate
Africa/Bangui
Africa/Maseru
Africa/Mbabane
Africa/Lagos
Factory
Antarctica/Mawson
America/Yellowknife
America/Denver
America/Boise
America/Inuvik
America/Phoenix
America/Shiprock
MST7MDT
Navajo
US/Arizona
US/Mountain
Pacific/Majuro
America/Montevideo
Indian/Maldives
America/Dawson_Creek
America/St_Johns
Canada/Newfoundland
Pacific/Norfolk
Pacific/Niue
Pacific/Auckland
Antarctica/McMurdo
Antarctica/South_Pole
America/Los_Angeles
America/Dawson
America/Vancouver
America/Whitehorse
Canada/Pacific
Canada/Yukon
PST8PDT
US/Pacific
US/Pacific-New
Pacific/Port_Moresby
Pacific/Enderbury
Pacific/Pitcairn
Pacific/Ponape
Pacific/Palau
Antarctica/Rothera
Africa/Johannesburg
Antarctica/Syowa
Indian/Kerguelen
Pacific/Fakaofo
Pacific/Tongatapu
Pacific/Truk
Pacific/Yap
Pacific/Funafuti
Etc/UCT
Etc/Universal
Etc/UTC
Etc/Zulu
vlasst
Antarctica/Vostok
Pacific/Wake
Africa/Kinshasa
Pacific/Wallis
Australia/Perth
Australia/West
fourth
seventh
eighth
eleventh
twelfth
previous
fortnight
fortnights
forthnight
forthnights
monday
tuesday
wednesday
thursday
friday
saturday
sunday
weekdays
january
february
august
september
october
november
december
The timezone could not be found in the database
America/Argentina/Buenos_Aires
America/Argentina/ComodRivadavia
America/Argentina/Rio_Gallegos
America/North_Dakota/New_Salem
local time zone must be set--see zic manual page
/usr/share/zoneinfo/%s
0.system
/usr/share/zoneinfo/%s/%s
posixrules
UTC/Local count:   %lu
Std/Wall count:    %lu
Leap.sec. count:   %lu
Trans. count:      %lu
Local types count: %lu
Zone Abbr. count:  %lu
%08X (%12ld) = %d
%8s (%12s) = %3d [%5ld %1d %3d '%s' (%d,%d)]
%08X (%12d) = %3d [%5ld %1d %3d '%s' (%d,%d)]
TYPE: %d 
 (DST)
 GMT %05d%s
 GMT 00000
 / %d.%d
 / %lld weekday
TS: %lld | %s%04lld-%02lld-%02lld %02lld:%02lld:%02lld
%3lldY %3lldM %3lldD / %3lldH %3lldM %3lldS
Stream-Context
column
libXML support
2.6.26
libXML Version
libXML streams
LIBXML_VERSION
LIBXML_DOTTED_VERSION
LIBXML_NOENT
LIBXML_DTDLOAD
LIBXML_DTDATTR
LIBXML_DTDVALID
LIBXML_NOERROR
LIBXML_NOWARNING
LIBXML_NOBLANKS
LIBXML_XINCLUDE
LIBXML_NSCLEAN
LIBXML_NOCDATA
LIBXML_NONET
LIBXML_COMPACT
LIBXML_NOXMLDECL
LIBXML_NOEMPTYTAG
LIBXML_ERR_NONE
LIBXML_ERR_WARNING
LIBXML_ERR_ERROR
LIBXML_ERR_FATAL
LibXMLError
%s in %s, line: %d
%s in Entity, line: %d
libxml
libxml_set_streams_context
libxml_use_internal_errors
libxml_get_last_error
libxml_clear_errors
libxml_get_errors
libxml_disable_entity_loader
use_errors
disable
memory allocation failure
error opening the file, %s
error reading the file, %s
no certificates in file, %s
OpenSSL key
OpenSSL X.509
RANDFILE
Unsupported private key type
unable to write random state
illegal length in timestamp
OpenSSL support
OpenSSL Version
OpenSSL X.509 CSR
PHP stream index
OPENSSL_VERSION_TEXT
OPENSSL_VERSION_NUMBER
X509_PURPOSE_SSL_CLIENT
X509_PURPOSE_SSL_SERVER
X509_PURPOSE_NS_SSL_SERVER
X509_PURPOSE_SMIME_SIGN
X509_PURPOSE_SMIME_ENCRYPT
X509_PURPOSE_CRL_SIGN
X509_PURPOSE_ANY
OPENSSL_ALGO_SHA1
OPENSSL_ALGO_MD5
OPENSSL_ALGO_MD4
OPENSSL_ALGO_DSS1
PKCS7_DETACHED
PKCS7_TEXT
PKCS7_NOINTERN
PKCS7_NOVERIFY
PKCS7_NOCHAIN
PKCS7_NOCERTS
PKCS7_NOATTR
PKCS7_BINARY
PKCS7_NOSIGS
OPENSSL_PKCS1_PADDING
OPENSSL_SSLV23_PADDING
OPENSSL_NO_PADDING
OPENSSL_PKCS1_OAEP_PADDING
OPENSSL_CIPHER_RC2_40
OPENSSL_CIPHER_RC2_128
OPENSSL_CIPHER_RC2_64
OPENSSL_CIPHER_DES
OPENSSL_CIPHER_3DES
OPENSSL_KEYTYPE_RSA
OPENSSL_KEYTYPE_DSA
OPENSSL_KEYTYPE_DH
OPENSSL_KEYTYPE_EC
OPENSSL_CONF
SSLEAY_CONF
openssl.cnf
verify_peer
cafile
capath
verify_depth
passphrase
ciphers
local_cert
allow_self_signed
CN_match
unable to stat %s
error loading file %s
error loading directory %s
extracerts
config
config_section_name
oid_file
oid_section
problem creating object %s=%s
digest_alg
default_md
x509_extensions
req_extensions
default_bits
private_key_bits
private_key_type
encrypt_key
encrypt_rsa_key
string_mask
request_extensions_section
file://
CERTIFICATE
Zl|a!s
issuer
serialNumber
validFrom
validTo
validFrom_time_t
validTo_time_t
purposes
email:
error opening file %s
ssZa!|ll
Invalid cipher type `%ld'
Failed to get cipher
%s: %s
sl|sass
OpenSSL X.509/key
Unknown signature algorithm.
unable to get private key
ssZZa!|ls
error getting private key
error getting cert
error opening input file %s!
error opening output file %s!
Zz|s!a!
Zs|s!a!
az|a!a!
distinguished_name
Error signing request
zzzs|a
friendly_name
ZZ!Zl|a!l
error unpacking public key
No memory
failed to sign it
Zszs|a
openssl_pkey_free
openssl_pkey_new
openssl_pkey_export
openssl_pkey_export_to_file
openssl_pkey_get_private
openssl_pkey_get_public
openssl_pkey_get_details
openssl_free_key
openssl_get_privatekey
openssl_get_publickey
openssl_x509_read
openssl_x509_free
openssl_x509_parse
openssl_x509_checkpurpose
openssl_x509_export
openssl_x509_export_to_file
openssl_pkcs12_export
openssl_pkcs12_export_to_file
openssl_pkcs12_read
openssl_csr_new
openssl_csr_export
openssl_csr_export_to_file
openssl_csr_sign
openssl_csr_get_subject
openssl_csr_get_public_key
openssl_sign
openssl_verify
openssl_seal
openssl_open
openssl_pkcs7_verify
openssl_pkcs7_decrypt
openssl_pkcs7_sign
openssl_pkcs7_encrypt
openssl_private_encrypt
openssl_private_decrypt
openssl_public_encrypt
openssl_public_decrypt
openssl_error_string
openssl
private key length is too short; it needs to be at least %d bits, not %d
unable to load random state; not enough random data!
illegal ASN1 data type for timestamp
unable to parse time string %s correctly
OpenSSL 0.9.8e-fips-rhel5 01 Jul 2008
Unable to set verify locations `%s' `%s'
Unable to set local cert chain file `%s'; Check that your cafile/capath settings include details of your certificate and its issuer
Unable to set private key file `%s'
Private key does not match certificate!
Could not get peer certificate
Could not verify peer: code:%d %s
Unable to locate peer certificate CN
Peer certificate CN=`%.*s' is malformed
Peer certificate CN=`%.*s' did not match expected CN=`%s'
problem loading oid section %s
Error loading %s section %s of %s
Invalid global string mask setting %s
supplied parameter cannot be coerced into an X509 certificate!
cannot get cert from parameter 1
signature OK, but cannot open %s for writing
key array must be of the form array(0 => key, 1 => phrase)
key type not supported in this PHP build!
supplied key param is a public key
Don't know how to get public key from this private key
unable to coerce parameter 4 into a private key
Fourth argument to openssl_seal() must be a non-empty array
not a public key (%dth member of pubkeys)
supplied key param cannot be coerced into a public key
supplied key param cannot be coerced into a private key
key parameter is not a valid public key
key parameter is not a valid private key
key param is not a valid private key
unable to coerce parameter 3 to x509 cert
error creating PKCS7 structure!
cannot get key from parameter 1
Unable to generate a private key
dn: add_entry_by_NID %d -> %s (failed)
dn: %s is not a recognized name
add_entry_by_txt %s -> %s (failed)
no objects specified in config file
attribs: add_entry_by_NID %d -> %s (failed)
add1_attr_by_txt %s -> %s (failed)
Error loading extension section %s
cannot get private key from parameter 3
private key does not correspond to cert
cannot get CSR from parameter 1
cannot get cert from parameter 2
private key does not correspond to signing cert
Signature verification problems
Signature did not match the certificate request
openssl_x509_check_private_key
Server: Microsoft-IIS
Server: GFE/
SSL: fatal protocol error
SSL: %s
OpenSSL Error messages:
SSL: connection timeout
capture_peer_cert
peer_certificate
capture_peer_cert_chain
peer_certificate_chain
Failed to enable crypto
Out of memory
tcp_socket/ssl
SSL_R_NO_SHARED_CIPHER: no suitable shared cipher could be used.  This could be because the server is missing an SSL certificate (local_cert context option)
SSL operation failed with code %d. %s%s
SSL/TLS already set-up for this stream
failed to create an SSL context
failed to create an SSL handle
supplied session stream must be an SSL enabled stream
PCRE Library Version
PREG_PATTERN_ORDER
PREG_SET_ORDER
PREG_OFFSET_CAPTURE
PREG_SPLIT_NO_EMPTY
PREG_SPLIT_DELIM_CAPTURE
PREG_SPLIT_OFFSET_CAPTURE
PREG_GREP_INVERT
PREG_NO_ERROR
PREG_INTERNAL_ERROR
PREG_BACKTRACK_LIMIT_ERROR
PREG_RECURSION_LIMIT_ERROR
PREG_BAD_UTF8_ERROR
PREG_BAD_UTF8_OFFSET_ERROR
PCRE_VERSION
Empty regular expression
([{< )]}> )]}>
Unknown modifier '%c'
Error while studying pattern
regexp code
Failed evaluating code: %s%s
Unknown error
Invalid flags specified
Get subpatterns list failed
ss|zll
ssz|ll
preg_match
preg_match_all
preg_replace
preg_replace_callback
preg_split
preg_quote
preg_grep
preg_last_error
pcre.backtrack_limit
100000
pcre.recursion_limit
PCRE (Perl Compatible Regular Expressions) Support
Internal pcre_fullinfo() error %d
Numeric named subpatterns are not allowed
Delimiter must not be alphanumeric or backslash
No ending delimiter '%c' found
No ending matching delimiter '%c' found
Compilation failed: %s at offset %d
Modifier /e cannot be used with replacement callback
Matched, but too many substrings
Unable to call custom replacement function
Parameter mismatch, pattern is a string while replacement is an array
Requires argument 2, '%s', to be a valid callback
2147483648
ZLib Support
compress.zlib://
Stream Wrapper support
zlib.inflate, zlib.deflate
Stream Filter support
Compiled Version
Linked Version
Content-Encoding: gzip
Content-Encoding: deflate
Vary: Accept-Encoding
Compression failed
zlib.*
compress.zlib
FORCE_GZIP
FORCE_DEFLATE
ref.outcontrol
ob_gzhandler
mb_output_handler
URL-Rewriter
zlib output compression
HTTP_ACCEPT_ENCODING
zlib.output_compression
zlib.output_compression_level
zlib.output_handler
readgzfile
gzrewind
gzclose
gzgetc
gzgets
gzgetss
gzread
gzopen
gzpassthru
gzseek
gztell
gzwrite
gzputs
gzcompress
gzuncompress
gzdeflate
gzinflate
gzencode
zlib_get_coding_type
compression level(%ld) must be within -1..9
encoding mode must be FORCE_GZIP or FORCE_DEFLATE
compression level (%ld) must be within -1..9
length (%ld) must be greater or equal zero
Cannot change zlib.output_handler - headers already sent
output handler 'ob_gzhandler' cannot be used twice
output handler 'ob_gzhandler' cannot be used after 'mb_output_handler'
output handler 'ob_gzhandler' cannot be used after 'URL-Rewriter'
Cannot use both zlib.output_compression and output_handler together!!
Cannot change zlib.output_compression - headers already sent
cannot open a zlib stream for reading and writing at the same time!
gzopen failed
SEEK_END is not supported
Failed allocating %zd bytes.
zlib.inflate
window
Invalid parameter give for window size. (%ld)
Invalid parameter give for memory level. (%ld)
Invalid compression level specified. (%ld)
Invalid filter parameter, ignored.
length may not be negative
Enabled
BZip2 Support
compress.bz2://
BZip2 Version
compress.bzip2
bzip2.*
compress.bzip2://
filename cannot be empty
bzopen
bzread
bzwrite
bzflush
bzclose
bzerrno
bzerrstr
bzerror
bzcompress
bzdecompress
blocksize
workfactor
could not read valid bz2 data from stream
bzip2.decompress, bzip2.compress
'%s' is not a valid mode for bzopen(). Only 'w' and 'r' are supported.
cannot use stream opened in mode '%s'
cannot read from a stream opened in write only mode
cannot write to a stream opened in read only mode
DFailed allocating %zu bytes.
bzip2.decompress
bzip2.compress
blocks
Invalid parameter given for number of blocks to allocate. (%ld)
Invalid parameter given for work factor. (%ld)
%i/%i/%i
invalid calendar ID %ld.
invalid date.
Year out of range (0-9999).
invalid calendar ID %ld
abbrevdayname
abbrevmonth
abbrevmonths
maxdaysinmonth
calname
calsymbol
Calendar support
CAL_GREGORIAN
CAL_JULIAN
CAL_JEWISH
CAL_FRENCH
CAL_NUM_CALS
CAL_DOW_DAYNO
CAL_DOW_SHORT
CAL_DOW_LONG
CAL_MONTH_GREGORIAN_SHORT
CAL_MONTH_GREGORIAN_LONG
CAL_MONTH_JULIAN_SHORT
CAL_MONTH_JULIAN_LONG
CAL_MONTH_JEWISH
CAL_MONTH_FRENCH
CAL_EASTER_DEFAULT
CAL_EASTER_ROMAN
CAL_EASTER_ALWAYS_GREGORIAN
CAL_EASTER_ALWAYS_JULIAN
CAL_JEWISH_ADD_ALAFIM_GERESH
CAL_JEWISH_ADD_ALAFIM
CAL_JEWISH_ADD_GERESHAYIM
jdtogregorian
gregoriantojd
jdtojulian
juliantojd
jdtojewish
jewishtojd
jdtofrench
frenchtojd
jddayofweek
jdmonthname
easter_date
easter_days
unixtojd
jdtounix
cal_to_jd
cal_from_jd
cal_days_in_month
cal_info
calendar
Gregorian
Julian
Jewish
French
juliandaycount
hebrew
Vendemiaire
Brumaire
Frimaire
Nivose
Pluviose
Ventose
Germinal
Floreal
Prairial
Messidor
Thermidor
Fructidor
Tishri
Heshvan
Kislev
Shevat
AdarII
Tammuz
This function is only valid for years between 1970 and 2037 inclusive
ctype functions
ctype_alnum
ctype_alpha
ctype_cntrl
ctype_digit
ctype_lower
ctype_graph
ctype_print
ctype_punct
ctype_space
ctype_upper
ctype_xdigit
UNICODE
FUJIFILM
MAKERNOTE
COMPUTED
ANY_TAG
THUMBNAIL
INTEROP
Thumbnail is not a JPEG image
UndefinedTag:0x%04X
exif_read_data#error_ifd
Illegal IFD offset
Multiple possible thumbnails
Illegal thumbnail size/offset
%s, %s
UNDEFINED
Skip SUB IFD
Illegal IFD Pointer
Unable to open file
Not a file
exif_read_data#error_mcom
No image in jpeg!
Invalid TIFF alignment marker
Invalid TIFF start (1)
Invalid IFD start
Company
Invalid JPEG file
Invalid TIFF file
File not supported
File too small (%d)
EXIF_USE_MBSTRING
EXIF Support
Supported EXIF Version
JPEG,TIFF
Supported filetypes
s|z/z/z/
FileDateTime
FileSize
SectionsFound
width="%d" height="%d"
IsColor
ByteOrderMotorola
%4.1Fmm
35mmFocalLength
CCDWidth
%0.3F s (1/%d)
ExposureTime
%0.3F s
f/%.1F
ApertureFNumber
Infinite
%0.2Fm
UserComment
UserCommentEncoding
Copyright
Copyright.Photographer
Copyright.Editor
Thumbnail.FileType
Thumbnail.MimeType
Thumbnail.Height
Thumbnail.Width
exif_read_data
read_exif_data
exif_tagname
exif_thumbnail
exif_imagetype
File structure corrupted
ACDComment
NewSubFile
PhotometricInterpretation
FillOrder
DocumentName
StripByteCounts
PlanarConfiguration
PageName
XPosition
YPosition
FreeOffsets
FreeByteCounts
GrayResponseUnit
GrayResponseCurve
T4Options
T6Options
PageNumber
Software
HostComputer
Predictor
PrimaryChromaticities
ColorMap
HalfToneHints
TileWidth
TileLength
TileOffsets
TileByteCounts
SubIFD
InkSet
InkNames
NumberOfInks
DotRange
TargetPrinter
ExtraSample
SampleFormat
SMinSampleValue
SMaxSampleValue
TransferRange
ClipPath
XClipPathUnits
YClipPathUnits
Indexed
JPEGTables
OPIProxy
JPEGProc
JPEGInterchangeFormat
JPEGInterchangeFormatLength
JPEGRestartInterval
JPEGLosslessPredictors
JPEGPointTransforms
JPEGQTables
JPEGDCTables
JPEGACTables
YCbCrSubSampling
ReferenceBlackWhite
ExtensibleMetadataPlatform
ICCProfileDescriptor
SRGBRenderingIntent
ImageTitle
ResolutionXUnit
ResolutionYUnit
ResolutionXLengthUnit
ResolutionYLengthUnit
PrintFlags
PrintFlagsVersion
PrintFlagsCrop
PrintFlagsBleedWidth
PrintFlagsBleedWidthScale
HalftoneLPI
HalftoneLPIUnit
HalftoneDegree
HalftoneShape
HalftoneMisc
HalftoneScreen
JPEGQuality
GridSize
ThumbnailFormat
ThumbnailWidth
ThumbnailHeight
ThumbnailColorDepth
ThumbnailPlanes
ThumbnailRawBytes
ThumbnailSize
ThumbnailCompressedSize
ColorTransferFunction
ThumbnailData
ThumbnailImageWidth
ThumbnailImageHeight
ThumbnailBitsPerSample
ThumbnailCompression
ThumbnailPhotometricInterp
ThumbnailImageDescription
ThumbnailEquipMake
ThumbnailEquipModel
ThumbnailStripOffsets
ThumbnailOrientation
ThumbnailSamplesPerPixel
ThumbnailRowsPerStrip
ThumbnailStripBytesCount
ThumbnailResolutionX
ThumbnailResolutionY
ThumbnailPlanarConfig
ThumbnailResolutionUnit
ThumbnailTransferFunction
ThumbnailSoftwareUsed
ThumbnailDateTime
ThumbnailArtist
ThumbnailWhitePoint
ThumbnailYCbCrCoefficients
ThumbnailYCbCrSubsampling
ThumbnailYCbCrPositioning
ThumbnailRefBlackWhite
ThumbnailCopyRight
LuminanceTable
ChrominanceTable
FrameDelay
LoopCount
PixelUnit
PixelPerUnitX
PixelPerUnitY
PaletteHistogram
RelatedImageFileFormat
ImageID
Matteing
DataType
ImageDepth
TileDepth
CFARepeatPatternDim
CFAPattern
BatteryLevel
IPTC/NAA
IT8RasterPadding
IT8ColorTable
ImageResourceInformation
Exif_IFD_Pointer
ICC_Profile
ExposureProgram
SpectralSensity
GPS_IFD_Pointer
ISOSpeedRatings
ExifVersion
DateTimeOriginal
DateTimeDigitized
ComponentsConfiguration
CompressedBitsPerPixel
ShutterSpeedValue
BrightnessValue
ExposureBiasValue
MaxApertureValue
SubjectDistance
MeteringMode
LightSource
FlashEnergy
SpatialFrequencyResponse
FocalPlaneXResolution
FocalPlaneYResolution
FocalPlaneResolutionUnit
ImageNumber
SecurityClassification
ImageHistory
SubjectLocation
ExposureIndex
TIFF/EPStandardID
SensingMethod
StoNits
MakerNote
SubSecTime
SubSecTimeOriginal
SubSecTimeDigitized
ImageSourceData
Comments
Author
Keywords
FlashPixVersion
ColorSpace
ExifImageWidth
ExifImageLength
RelatedSoundFile
InteroperabilityOffset
FileSource
SceneType
CustomRendered
ExposureMode
WhiteBalance
DigitalZoomRatio
FocalLengthIn35mmFilm
SceneCaptureType
GainControl
Contrast
Saturation
Sharpness
DeviceSettingDescription
SubjectDistanceRange
ImageUniqueID
No tag value
Computed value
GPSVersion
GPSLatitudeRef
GPSLatitude
GPSLongitudeRef
GPSLongitude
GPSAltitudeRef
GPSAltitude
GPSTimeStamp
GPSSatellites
GPSStatus
GPSMeasureMode
GPSDOP
GPSSpeedRef
GPSSpeed
GPSTrackRef
GPSTrack
GPSImgDirectionRef
GPSImgDirection
GPSMapDatum
GPSDestLatitudeRef
GPSDestLatitude
GPSDestLongitudeRef
GPSDestLongitude
GPSDestBearingRef
GPSDestBearing
GPSDestDistanceRef
GPSDestDistance
GPSProcessingMode
GPSAreaInformation
GPSDateStamp
GPSDifferential
InterOperabilityIndex
InterOperabilityVersion
RelatedFileFormat
RelatedImageWidth
RelatedImageHeight
FUJIFILM
OLYMPUS OPTICAL CO.,LTD
exif.encode_unicode
ISO-8859-15
exif.decode_unicode_motorola
UCS-2BE
exif.decode_unicode_intel
UCS-2LE
exif.encode_jis
exif.decode_jis_motorola
exif.decode_jis_intel
sections_needed
sub_arrays
read_thumbnail
height
imagefile
standard
ModeArray
ImageInfo
ImageType
FirmwareVersion
OwnerName
Camera
CustomFunctions
RecordingMode
FocusingMode
FlashMode
FlashIntensity
ObjectDistance
DigitalZoom
CCDSensitivity
FlashStrength
FocusMode
SlowSync
PictureMode
ContTake
BlurWarning
FocusWarning
AEWarning 
ColorMode
ImageAdjustment
Converter
ISOSetting
ImageSharpening
FlashSetting
ISOSelection
AuxiliaryLens
ManualFocusDistance
AFFocusPosition
DataDump
SpecialMode
SoftwareRelease
PictureInfo
CameraId
Could not compute size of thumbnail
Illegal IFD size: x%04X + 2 + x%04X*12 = x%04X > x%04X
exif_read_data#error_mult_thumb
corrupt EXIF header: maximum directory nesting level reached
Process tag(x%04X=%s): Illegal format code 0x%04X, suppose BYTE
Process tag(x%04X=%s): Illegal byte_count(%ld)
Process tag(x%04X=%s): Illegal pointer offset(x%04X < x%04X)
Process tag(x%04X=%s): Illegal pointer offset(x%04X + x%04X = x%04X > x%04X)
Wrong file pointer: 0x%08X != 0x%08X
Illegal IFD size: 2 + x%04X*12 = x%04X > x%04X
Read from TIFF: tag(0x%04X,%12s): Illegal format code 0x%04X, switching to BYTE
Error in TIFF: filesize(x%04X) less than size of IFD(x%04X + x%04X)
Error in TIFF: filesize(x%04X) less than size of IFD(x%04X)
Error in TIFF: filesize(x%04X) less than size of IFD dir(x%04X)
Error in TIFF: filesize(x%04X) less than start of IFD dir(x%04X)
Image has corrupt COM section: some software set wrong length information
Error reading from file: got=x%04X(=%d) != itemlen-2=x%04X(=%d)
Incorrect APP1 Exif Identifier Code
1.4 $Id: exif.c 293036 2010-01-03 09:23:27Z sebastian $
Unexpected end of file reached
ThumbnailPrimaryChromaticities
Thumbnail goes IFD boundary or end of file reached
Illegal reallocating of undefined file section
$Revision: 298196 $
Revision
INPUT_POST
INPUT_GET
INPUT_COOKIE
INPUT_ENV
INPUT_SERVER
INPUT_SESSION
INPUT_REQUEST
FILTER_FLAG_NONE
FILTER_REQUIRE_SCALAR
FILTER_REQUIRE_ARRAY
FILTER_FORCE_ARRAY
FILTER_NULL_ON_FAILURE
FILTER_VALIDATE_INT
FILTER_VALIDATE_BOOLEAN
FILTER_VALIDATE_FLOAT
FILTER_VALIDATE_REGEXP
FILTER_VALIDATE_URL
FILTER_VALIDATE_EMAIL
FILTER_VALIDATE_IP
FILTER_DEFAULT
FILTER_UNSAFE_RAW
FILTER_SANITIZE_STRING
FILTER_SANITIZE_STRIPPED
FILTER_SANITIZE_ENCODED
FILTER_SANITIZE_SPECIAL_CHARS
FILTER_SANITIZE_EMAIL
FILTER_SANITIZE_URL
FILTER_SANITIZE_NUMBER_INT
FILTER_SANITIZE_NUMBER_FLOAT
FILTER_SANITIZE_MAGIC_QUOTES
FILTER_CALLBACK
FILTER_FLAG_ALLOW_OCTAL
FILTER_FLAG_ALLOW_HEX
FILTER_FLAG_STRIP_LOW
FILTER_FLAG_STRIP_HIGH
FILTER_FLAG_ENCODE_LOW
FILTER_FLAG_ENCODE_HIGH
FILTER_FLAG_ENCODE_AMP
FILTER_FLAG_NO_ENCODE_QUOTES
FILTER_FLAG_EMPTY_STRING_NULL
FILTER_FLAG_ALLOW_FRACTION
FILTER_FLAG_ALLOW_THOUSAND
FILTER_FLAG_ALLOW_SCIENTIFIC
FILTER_FLAG_SCHEME_REQUIRED
FILTER_FLAG_HOST_REQUIRED
FILTER_FLAG_PATH_REQUIRED
FILTER_FLAG_QUERY_REQUIRED
FILTER_FLAG_IPV4
FILTER_FLAG_IPV6
FILTER_FLAG_NO_RES_RANGE
FILTER_FLAG_NO_PRIV_RANGE
boolean
validate_regexp
validate_url
validate_email
validate_ip
stripped
encoded
special_chars
unsafe_raw
number_int
number_float
magic_quotes
filter_input
filter_var
filter_input_array
filter_var_array
filter_list
filter_has_var
filter_id
0.11.0
filter.default
filter.default_flags
INPUT_SESSION is not yet implemented
INPUT_REQUEST is not yet implemented
Input Validation and Filtering
Numeric keys are not allowed in the definition array
Empty keys are not allowed in the definition array
+-0123456789
abcdefghijklmnopqrstuvwxyzABCDEFGHIJKLMNOPQRSTUVWXYZ0123456789$-_.+!*'(),{}|\^~[]`<>#%";/?:@&=
abcdefghijklmnopqrstuvwxyzABCDEFGHIJKLMNOPQRSTUVWXYZ0123456789!#$%&'*+-=?^_`{|}~@.[]
abcdefghijklmnopqrstuvwxyzABCDEFGHIJKLMNOPQRSTUVWXYZ0123456789-._
0123456789ABCDEF
min_range
max_range
decimal
2001:0db8
2001:001
mailto
'regexp' option missing
decimal separator must be one char
/^(?!(?:(?:\x22?\x5C[\x00-\x7E]\x22?)|(?:\x22?[^\x5C\x22]\x22?)){255,})(?!(?:(?:\x22?\x5C[\x00-\x7E]\x22?)|(?:\x22?[^\x5C\x22]\x22?)){65,}@)(?:(?:[\x21\x23-\x27\x2A\x2B\x2D\x2F-\x39\x3D\x3F\x5E-\x7E]+)|(?:\x22(?:[\x01-\x08\x0B\x0C\x0E-\x1F\x21\x23-\x5B\x5D-\x7F]|(?:\x5C[\x00-\x7F]))*\x22))(?:\.(?:(?:[\x21\x23-\x27\x2A\x2B\x2D\x2F-\x39\x3D\x3F\x5E-\x7E]+)|(?:\x22(?:[\x01-\x08\x0B\x0C\x0E-\x1F\x21\x23-\x5B\x5D-\x7F]|(?:\x5C[\x00-\x7F]))*\x22)))*@(?:(?:(?!.*[^.]{64,})(?:(?:(?:xn--)?[a-z0-9]+(?:-+[a-z0-9]+)*\.){1,126}){1,}(?:(?:[a-z][a-z0-9]*)|(?:(?:xn--)[a-z0-9]+))(?:-+[a-z0-9]+)*)|(?:\[(?:(?:IPv6:(?:(?:[a-f0-9]{1,4}(?::[a-f0-9]{1,4}){7})|(?:(?!(?:.*[a-f0-9][:\]]){7,})(?:[a-f0-9]{1,4}(?::[a-f0-9]{1,4}){0,5})?::(?:[a-f0-9]{1,4}(?::[a-f0-9]{1,4}){0,5})?)))|(?:(?:IPv6:(?:(?:[a-f0-9]{1,4}(?::[a-f0-9]{1,4}){5}:)|(?:(?!(?:.*[a-f0-9]:){5,})(?:[a-f0-9]{1,4}(?::[a-f0-9]{1,4}){0,3})?::(?:[a-f0-9]{1,4}(?::[a-f0-9]{1,4}){0,3}:)?)))?(?:(?:25[0-5])|(?:2[0-4][0-9])|(?:1[0-9]{2})|(?:[1-9]?[0-9]))(?:\.(?:(?:25[0-5])|(?:2[0-4][0-9])|(?:1[0-9]{2})|(?:[1-9]?[0-9]))){3}))\]))$/iD
2147483648
First argument is expected to be a valid callback
FTP Buffer
Unknown option '%ld'
rssl|l
rsrl|l
rrsl|l
Error opening %s
FTP support
FTP_ASCII
FTP_TEXT
FTP_BINARY
FTP_IMAGE
FTP_AUTORESUME
FTP_TIMEOUT_SEC
FTP_AUTOSEEK
FTP_FAILED
FTP_FINISHED
FTP_MOREDATA
ftp_connect
ftp_ssl_connect
ftp_login
ftp_pwd
ftp_cdup
ftp_chdir
ftp_exec
ftp_raw
ftp_mkdir
ftp_rmdir
ftp_chmod
ftp_alloc
ftp_nlist
ftp_rawlist
ftp_systype
ftp_pasv
ftp_get
ftp_fget
ftp_put
ftp_fput
ftp_size
ftp_mdtm
ftp_rename
ftp_delete
ftp_site
ftp_close
ftp_set_option
ftp_get_option
ftp_nb_fget
ftp_nb_get
ftp_nb_continue
ftp_nb_put
ftp_nb_fput
ftp_quit
username
password
command
response
local_file
remote_file
resume_pos
resumepos
startpos
Option TIMEOUT_SEC expects value of type long, %s given
Timeout has to be greater than 0
Option AUTOSEEK expects value of type boolean, %s given
Mode must be FTP_ASCII or FTP_BINARY
no nbronous transfer to continue.
%4u%2u%2u%2u%2u%2u
%lu,%lu,%lu,%lu,%lu,%lu
socket() failed: %s (%d)
bind() failed: %s (%d)
getsockname() failed: %s (%d)
listen() failed: %s (%d)
|2|%s|%hu|
%u,%u,%u,%u,%u,%u
LIST -R
CHMOD %o %s
SITE EXEC
SSL/TLS handshake failed
getsockname failed: %s (%d)
data_accept: failed to create the SSL context
data_accept: failed to create the SSL handle
data_accept: SSL/TLS handshake failed
php_connect_nonb() failed: %s (%d)
Unable to create temporary file.  Check permissions in temporary files directory.
failed to create the SSL context
failed to create the SSL handle
domain passed too long
msgid1
%s passed too long
msgid2
GetText Support
dgettext
dcgettext
bindtextdomain
dngettext
dcngettext
bind_textdomain_codeset
domain_name
category
The first parameter of bindtextdomain must not be empty
Unable to convert variable to GMP - wrong type
Number has to be greater than or equal to 0
Second parameter cannot be less than 0
Starting index must be greater than or equal to zero
Index must be greater than or equal to zero
Negative exponent not supported
Bad base for conversion: %d (should be between 2 and 36)
GMP integer
gmp support
GMP version
GMP_ROUND_ZERO
GMP_ROUND_PLUSINF
GMP_ROUND_MINUSINF
GMP_VERSION
Bad base for conversion: %d
Zero operand not allowed
gmp_init
gmp_intval
gmp_strval
gmp_add
gmp_sub
gmp_mul
gmp_div_qr
gmp_div_q
gmp_div_r
gmp_div
gmp_mod
gmp_divexact
gmp_neg
gmp_abs
gmp_fact
gmp_sqrt
gmp_sqrtrem
gmp_pow
gmp_powm
gmp_perfect_square
gmp_prob_prime
gmp_gcd
gmp_gcdext
gmp_invert
gmp_jacobi
gmp_legendre
gmp_cmp
gmp_sign
gmp_random
gmp_and
gmp_or
gmp_com
gmp_xor
gmp_setbit
gmp_clrbit
gmp_scan0
gmp_scan1
gmp_popcount
gmp_hamdist
gmp_nextprime
gmpnumber
set_clear
hash support
Hashing Engines
Hash Context
sha256
sha384
sha512
ripemd128
ripemd160
ripemd256
ripemd320
whirlpool
tiger128,3
tiger160,3
tiger192,3
tiger128,4
tiger160,4
tiger192,4
snefru
adler32
crc32b
haval128,3
haval160,3
haval192,3
haval224,3
haval256,3
haval128,4
haval160,4
haval192,4
haval224,4
haval256,4
haval128,5
haval160,5
haval192,5
haval224,5
haval256,5
HASH_HMAC
Unknown hashing algorithm: %s
HMAC requested without a key
hash_file
hash_hmac
hash_hmac_file
hash_init
hash_update
hash_update_stream
hash_update_file
hash_final
hash_algos
raw_output
0123456789abcdef
Fai4@~
D7q/;M
 iciNWq
enmty)3q]8
4@[![)Y	
P=L^uh
:xgzbP?
ty*x%5
e}O`n$
pVCouIhZaB
v("O'P
mu_Iqw
--n	k	
Wxiw2L
w(.A9,
AUk[M.
XO'b[Q
@I&<X~U!
}N5Swoy
*G	QJ:
@8CD/EUMF]Lv
/lVRgb
_fgpa 
NskJA6
8~ROl9
+rd&r0E
RvaDuDr
e[+2XS
s\:_Jv<j
MYj8	`y
$N8i\=
W$PvKAZ
tc~!HDjO#=%
U`/\Xb
^i&J#Yc
1i|lNQ
Ks@r'\]
oKS9Q7
d=+:Al|
Uk6NPV
LmRR3c
LWv0j8
1-ix=i!
nBO!OO
zbK1KK]
jJ5JJD
prI9II_
uzH=HHT
_a__=@
dRM)MMv9
aZL-LL
QYQQ%/
kJN%NNfsQ
-H	$		
nBO!OO
zbK1KK)
jJ5JJ 
prI9II;
uzH=HH2
dRM)MM
aZL-LL
kJN%NN
FFLE&	
-H	$		A
nBO!OO
..C\zbK1KK)
jJ5JJ 
))|R"P
2prI9II;
huzH=HH2
dRM)MM
raZL-LL
kJN%NN
-H	$		A
bK1KK)
jJ5JJ 
2}rI9II;
zH=HH2
.RM)MM
H	$		A
mK1KK)
HK[q[[
aZ^e^^
o	$		A
m.1KK)
aZLe^^
oi$		A
nBO!66
_a  =@
aZL-^^
-H	$pp
nBO!O6
_a_ =@
aZL-L^
-H	$	p
Qkkbal
iconv.input_encoding
iconv.output_encoding
iconv.internal_encoding
Cannot open converter
Buffer length exceeded
Malformed string
Unknown error (%d)
ICONV_IMPL
ICONV_VERSION
ICONV_MIME_DECODE_STRICT
iconv support
iconv implementation
iconv library version
text/html
Content-Type:%s; charset=%s
scheme
input-charset
output-charset
line-length
line-break-chars
ob_iconv_handler
iconv_get_encoding
iconv_set_encoding
iconv_strlen
iconv_substr
iconv_strpos
iconv_strrpos
iconv_mime_encode
iconv_mime_decode
iconv_mime_decode_headers
convert.iconv.*
ISO-8859-1
in_charset
out_charset
haystack
needle
field_name
field_value
preference
encoded_string
Charset parameter exceeds the maximum allowed length of %d characters
Wrong charset, conversion from `%s' to `%s' is not allowed
Detected an incomplete multibyte character in input string
Detected an illegal character in input string
Offset not contained in string.
ICONV_MIME_DECODE_CONTINUE_ON_ERROR
iconv stream filter ("%s"=>"%s"): invalid multibyte sequence
iconv stream filter ("%s"=>"%s"): insufficient buffer
iconv stream filter ("%s"=>"%s"): unknown error
iconv stream filter ("%s"=>"%s"): unexpected octet values
0123456789ABCDEF
Reflection
Required
Conflicts
%s%s%s%s%s
Parameter is not optional
Internal error
abstract
static
Extension %s does not exist
Class %s does not exist
Interface %s does not exist
Interface %s is a Class
parent
    %sEntry [ %s <
%sPERDIR
%sSYSTEM
    %s  Current = '%s'
    %s  Default = '%s'
    %s}
%sProperty [ 
<dynamic> public $%s
<implicit> 
<default> 
public 
private 
protected 
IS_DEPRECATED
IS_STATIC
IS_PUBLIC
IS_PROTECTED
IS_PRIVATE
IS_ABSTRACT
IS_FINAL
IS_IMPLICIT_ABSTRACT
IS_EXPLICIT_ABSTRACT
ReflectionException
Reflector
ReflectionFunctionAbstract
ReflectionFunction
ReflectionParameter
ReflectionMethod
ReflectionClass
ReflectionObject
ReflectionProperty
ReflectionExtension
__tostring
Could not create reflector
Parameter #%d [ 
<optional> 
<required> 
or NULL 
array 
$param%d
Non-object passed to Invoke()
Function %s() does not exist
%sMethod [ 
%sFunction [ 
<internal
, deprecated
, inherits %s
, overwrites %s
, prototype %s
, ctor
, dtor
abstract 
final 
<visibility error> 
method 
function 
%s ] {
%s  @@ %s %d - %d
%s- Parameters [%d] {
%sExtension [ 
<persistent>
<temporary>
<no_version>
  - Dependencies {
%s    Dependency [ %s (
  - INI {
  - Constants [%d] {
  - Functions {
%s    
  - Classes [%d] {
%sObject of class [ 
%s%s [ 
<iterateable> 
class 
 extends %s
 implements %s
%s  @@ %s %d-%d
%s  - Constants [%d] {
%s  - Static methods [%d] {
%s  - Properties [%d] {
%s  - Methods [%d] {
%s  - Methods [0] {
Method %s does not exist
Property %s does not exist
Invalid method name %s
getModifierNames
__toString
__clone
isInternal
isUserDefined
getFileName
getStartLine
getEndLine
getDocComment
getStaticVariables
returnsReference
getParameters
getNumberOfParameters
getNumberOfRequiredParameters
getExtension
getExtensionName
isDeprecated
isDisabled
invoke
invokeArgs
isPassedByReference
getDeclaringFunction
getDeclaringClass
getClass
isArray
allowsNull
getPosition
isOptional
isDefaultValueAvailable
getDefaultValue
isPublic
isPrivate
isProtected
isAbstract
isFinal
isStatic
isConstructor
isDestructor
getModifiers
getPrototype
isInstantiable
getConstructor
hasMethod
getMethod
getMethods
hasProperty
getProperty
getProperties
hasConstant
getConstants
getConstant
getInterfaces
getInterfaceNames
isInterface
isInstance
newInstance
newInstanceArgs
getParentClass
isSubclassOf
getStaticProperties
getStaticPropertyValue
setStaticPropertyValue
getDefaultProperties
isIterateable
implementsInterface
getValue
setValue
isDefault
getVersion
getFunctions
getINIEntries
getClasses
getClassNames
getDependencies
class_or_method
interface
$Id: php_reflection.c 300129 2010-06-03 00:43:37Z felipe $
Cannot set read-only property %s::$%s
Internal error: Failed to retrieve the reflection object
Internal error: Cannot find extension function %s in global function table
Cannot determine default value for internal functions
Cannot clone object using __clone()
%s() cannot be called statically
Method %s::%s does not have a prototype
The parameter class is expected to be either a string or an object
Property %s::$%s does not exist
Internal error: Failed to retrieve the argument's reflection object
Parameter one must either be a string or a ReflectionClass object
Access to non-public constructor of class %s
Invocation of %s's constructor failed
Class %s does not have a constructor, so you cannot pass any constructor arguments
Parameter uses 'self' as type hint but function is not a class member!
Parameter uses 'parent' as type hint but function is not a class member!
Parameter uses 'parent' as type hint although class does not have a parent!
%s    Constant [ %s %s ] { %s }
Class %s does not have a property named %s
Trying to invoke abstract method %s::%s()
Trying to invoke %s method %s::%s() from scope %s
Trying to invoke non static method %s::%s() without an object
Given object is not an instance of the class this method was declared in
Invocation of method %s::%s() failed
Invocation of function %s() failed
Invocation of method __toString() failed
%s::__toString() did not return anything
Could not execute reflection::export()
Cannot access non-public member %s::%s
Internal error: Could not find the property %s::%s
Invoke() expects at least one parameter, none given
 extension #%d %s version %s ] {
%s  - Static properties [%d] {
%s  - Dynamic properties [%d] {
Fully qualified property name %s::%s does not specify a base class of %s
Method %s::%s() does not exist
Expected array($object, $method) or array($classname, $method)
The parameter class is expected to be either a string or an array(class, method)
The parameter specified by its offset could not be found
The parameter specified by its name could not be found
Unknown session.serialize_handler. Failed to encode session object
Cannot encode non-existent session
Argument %d is not a valid callback
Trying to destroy uninitialized session
Session object destruction failed
Unknown session.serialize_handler. Failed to decode session object
Failed to decode session object. Session has been destroyed
Cannot send session cookie - headers already sent by (output started at %s:%d)
Cannot send session cookie - headers already sent
Cannot regenerate session id - headers already sent
Expires: Thu, 19 Nov 1981 08:52:00 GMT
Cache-Control: no-store, no-cache, must-revalidate, post-check=0, pre-check=0
A session is active. You cannot change the session module's ini settings at this time
Cannot find serialization handler '%s'
The ini setting hash_bits_per_character is out of range (should be 4, 5, or 6) - using 4 for now
Registered serializer handlers
The session bug compatibility code will not try to locate the global variable $%lu due to its numeric nature
Your script possibly relies on a session side-effect which existed until PHP 4.2.3. Please be advised that the session extension does not consider global variables as a source of data, unless register_globals is enabled. You can disable this functionality and this warning by setting session.bug_compat_42 or session.bug_compat_warn to off, respectively
Failed to write session data (%s). Please verify that the current setting of session.save_path is correct (%s)
A session had already been started - ignoring session_start()
Cannot find save handler '%s' - session startup failed
Cannot find serialization handler '%s' - session startup failed
No storage module chosen - failed to initialize session
Failed to initialize storage module: %s (path: %s)
Cannot send session cache limiter - headers already sent (output started at %s:%d)
Cannot send session cache limiter - headers already sent
Cannot find named PHP session module (%s)
%s, %02d %s %d %02d:%02d:%02d GMT
Cache-Control: public, max-age=%ld
Cache-Control: private, max-age=%ld, pre-check=%ld
session.hash_bits_per_character
session.save_handler
D, d-M-Y H:i:s T
Pragma: no-cache
Cannot find save handler '%s'
REMOTE_ADDR
%.15s%ld%ld%0.8F
Invalid session hash function
Skipping numeric key %ld
Session Support
Registered save handlers
session.serialize_handler
REQUEST_URI
HTTP_REFERER
	 <>'"\
HTTP_SESSION_VARS
session.cache_expire
session.cache_limiter
session.save_path
session.name
session.cookie_lifetime
session.cookie_path
session.cookie_domain
session.cookie_secure
session.cookie_httponly
session
php_binary
session.bug_compat_42
session.bug_compat_warn
PHPSESSID
session.auto_start
session.gc_probability
session.gc_divisor
session.gc_maxlifetime
session.use_cookies
session.use_only_cookies
session.referer_check
session.entropy_file
session.entropy_length
nocache
session.use_trans_sid
session.hash_function
private_no_expire
session_name
session_module_name
session_save_path
session_id
session_regenerate_id
session_decode
session_register
session_unregister
session_is_registered
session_encode
session_start
session_destroy
session_unset
session_set_save_handler
session_cache_limiter
session_cache_expire
session_set_cookie_params
session_get_cookie_params
session_write_close
session_commit
0123456789abcdefghijklmnopqrstuvwxyzABCDEFGHIJKLMNOPQRSTUVWXYZ,-
ps_files_cleanup_dir: opendir(%s) failed: %s (%d)
The session id is too long or contains illegal characters, valid characters are a-z, A-Z, 0-9 and '-,'
fcntl(%d, F_SETFD, FD_CLOEXEC) failed: %s (%d)
open(%s, O_RDWR) failed: %s (%d)
write wrote less bytes than requested
read returned less bytes than requested
The first parameter in session.save_path is invalid
The second parameter in session.save_path is invalid
write failed: %s (%d)
read failed: %s (%d)
not a shmop resource
offset out of range
%s is not a valid flag
invalid access mode
shmop support
start is out of range
count is out of range
shmop_open
shmop_read
shmop_close
shmop_size
shmop_write
shmop_delete
no shared memory segment with an id of [%lu]
can't mark segment for deletion (are you the owner?)
trying to write to a read only segment
Shared memory segment size must be greater then zero.
unable to attach or create shared memory segment
unable to get shared memory segment information
unable to attach to shared memory segment
Cannot clone object of class %s due to 'zend.ze1_compatibility_mode'
Imported Node must have associated Document
An iterator cannot be used with foreach by reference
String could not be parsed as XML
Unable to locate parent Element
Attribute requires prefix for namespace
Cannot add element to attributes
Cannot add child. Parent is not a permanent member of the XML tree
Cannot create unnamed attribute
Cannot add element %s number %ld when only 0 such elements exist
Cannot add element %s number %ld when only %ld such elements exist
Cannot write or create unnamed %s
It is not yet possible to assign complex types to %s
Cannot create duplicate attribute
It is not possible to assign complex types to nodes
Cannot assign to an array of nodes (duplicate subnodes or attr detected)
Cannot change attribute number %ld when only %d attributes exist
Simplexml support
$Revision: 299016 $
Schema support
SimpleXMLElement
Invalid Nodetype to import
s|C!lsb
s|lbsb
Node no longer exists
Attribute name is required
Attribute already exists
s|s!s!
Element name is required
@attributes
Unable to cast node to string
simplexml_load_file
simplexml_load_string
simplexml_import_dom
SimpleXML
saveXML
registerXPathNamespace
getNamespaces
getDocNamespaces
addChild
addAttribute
Socket
unable to shutdown socket
%s [%d]: %s
l_onoff
l_linger
Host lookup failed
rslls|l
Unsupported socket type %d
unable to write to socket
Path too long
unable to connect
unable to listen on socket
0.0.0.0
Sockets Support
AF_UNIX
AF_INET
AF_INET6
MSG_OOB
MSG_WAITALL
MSG_DONTWAIT
MSG_PEEK
MSG_DONTROUTE
MSG_EOR
MSG_EOF
SO_DEBUG
SO_REUSEADDR
SO_KEEPALIVE
SO_DONTROUTE
SO_LINGER
SO_BROADCAST
SO_OOBINLINE
SO_SNDBUF
SO_RCVBUF
SO_SNDLOWAT
SO_RCVLOWAT
SO_SNDTIMEO
SO_RCVTIMEO
SO_TYPE
SO_ERROR
SOL_SOCKET
SOMAXCONN
TCP_NODELAY
PHP_NORMAL_READ
PHP_BINARY_READ
SOCKET_EPERM
SOCKET_ENOENT
SOCKET_EINTR
SOCKET_EIO
SOCKET_ENXIO
SOCKET_E2BIG
SOCKET_EBADF
SOCKET_EAGAIN
SOCKET_ENOMEM
SOCKET_EACCES
SOCKET_EFAULT
SOCKET_ENOTBLK
SOCKET_EBUSY
SOCKET_EEXIST
SOCKET_EXDEV
SOCKET_ENODEV
SOCKET_ENOTDIR
SOCKET_EISDIR
SOCKET_EINVAL
SOCKET_ENFILE
SOCKET_EMFILE
SOCKET_ENOTTY
SOCKET_ENOSPC
SOCKET_ESPIPE
SOCKET_EROFS
SOCKET_EMLINK
SOCKET_EPIPE
SOCKET_ENAMETOOLONG
SOCKET_ENOLCK
SOCKET_ENOSYS
SOCKET_ENOTEMPTY
SOCKET_ELOOP
SOCKET_EWOULDBLOCK
SOCKET_ENOMSG
SOCKET_EIDRM
SOCKET_ECHRNG
SOCKET_EL2NSYNC
SOCKET_EL3HLT
SOCKET_EL3RST
SOCKET_ELNRNG
SOCKET_EUNATCH
SOCKET_ENOCSI
SOCKET_EL2HLT
SOCKET_EBADE
SOCKET_EBADR
SOCKET_EXFULL
SOCKET_ENOANO
SOCKET_EBADRQC
SOCKET_EBADSLT
SOCKET_ENOSTR
SOCKET_ENODATA
SOCKET_ETIME
SOCKET_ENOSR
SOCKET_ENONET
SOCKET_EREMOTE
SOCKET_ENOLINK
SOCKET_EADV
SOCKET_ESRMNT
SOCKET_ECOMM
SOCKET_EPROTO
SOCKET_EMULTIHOP
SOCKET_EBADMSG
SOCKET_ENOTUNIQ
SOCKET_EBADFD
SOCKET_EREMCHG
SOCKET_ERESTART
SOCKET_ESTRPIPE
SOCKET_EUSERS
SOCKET_ENOTSOCK
SOCKET_EDESTADDRREQ
SOCKET_EMSGSIZE
SOCKET_EPROTOTYPE
SOCKET_ENOPROTOOPT
SOCKET_EPROTONOSUPPORT
SOCKET_ESOCKTNOSUPPORT
SOCKET_EOPNOTSUPP
SOCKET_EPFNOSUPPORT
SOCKET_EAFNOSUPPORT
SOCKET_EADDRINUSE
SOCKET_EADDRNOTAVAIL
SOCKET_ENETDOWN
SOCKET_ENETUNREACH
SOCKET_ENETRESET
SOCKET_ECONNABORTED
SOCKET_ECONNRESET
SOCKET_ENOBUFS
SOCKET_EISCONN
SOCKET_ENOTCONN
SOCKET_ESHUTDOWN
SOCKET_ETOOMANYREFS
SOCKET_ETIMEDOUT
SOCKET_ECONNREFUSED
SOCKET_EHOSTDOWN
SOCKET_EHOSTUNREACH
SOCKET_EALREADY
SOCKET_EINPROGRESS
SOCKET_EISNAM
SOCKET_EREMOTEIO
SOCKET_EDQUOT
SOCKET_ENOMEDIUM
SOCKET_EMEDIUMTYPE
SOL_TCP
SOL_UDP
unable to bind address
unable to read from socket
no key "%s" passed in optval
unable to set socket option
a!a!a!z!|l
unable to select [%d]: %s
rzllz|z
unable to recvfrom
unable to retrieve peer name
Unsupported address family %d
socket_select
socket_create
socket_create_listen
socket_create_pair
socket_set_nonblock
socket_set_block
socket_listen
socket_close
socket_write
socket_read
socket_getsockname
socket_getpeername
socket_connect
socket_strerror
socket_bind
socket_recv
socket_send
socket_get_option
socket_set_option
socket_last_error
socket_clear_error
socket_getopt
socket_setopt
sockets
unable to retrieve socket option
Host lookup failed: Non AF_INET domain returned on AF_INET socket
Host lookup failed: Non AF_INET6 domain returned on AF_INET6 socket
Socket of type AF_INET6 requires 3 arguments
Socket of type AF_INET requires 3 arguments
invalid socket domain [%ld] specified for argument 1, assuming AF_INET
invalid socket type [%ld] specified for argument 2, assuming SOCK_STREAM
Unable to create socket [%d]: %s
unable to accept incoming connection
unable to create listening socket
unable to bind to given address
unsupported socket type '%d', must be AF_UNIX, AF_INET, or AF_INET6
unable to create socket pair [%d]: %s
no resource arrays were passed to select
unable to retrieve socket name
.inc,.php
__autoload
spl_autoload_call
spl_autoload
Class %s could not be loaded
 and could not be loaded
Class %s does not exist%s
object or string expected
a callable
an existing
Function '%s' not %s
Illegal value passed
SPL support
spl_classes
spl_autoload_extensions
spl_autoload_register
spl_autoload_unregister
spl_autoload_functions
class_parents
class_implements
spl_object_hash
iterator_to_array
iterator_count
iterator_apply
Traversable
use_keys
simplexml
Function spl_autoload_call() cannot be registered
Passed array specifies a non static method but no object
Passed array does not specify %s %smethod
endIteration
callHasChildren
nextelement
callGetChildren
beginchildren
endchildren
beginIteration
RecursiveIterator
RecursiveIteratorIterator
LEAVES_ONLY
SELF_FIRST
CHILD_FIRST
CATCH_GET_CHILD
OuterIterator
RecursiveFilterIterator
ParentIterator
Countable
SeekableIterator
LimitIterator
CALL_TOSTRING
TOSTRING_USE_KEY
TOSTRING_USE_CURRENT
TOSTRING_USE_INNER
FULL_CACHE
RecursiveCachingIterator
NoRewindIterator
AppendIterator
InfiniteIterator
GET_MATCH
ALL_MATCHES
REPLACE
replacement
RecursiveRegexIterator
EmptyIterator
Illegal mode %ld
getiterator
beginiteration
enditeration
callhaschildren
callgetchildren
Parameter offset must be >= 0
Os|lll
Undefined index:  %s
hasChildren
getChildren
current
getDepth
getSubIterator
getInnerIterator
beginChildren
endChildren
nextElement
setMaxDepth
getMaxDepth
hasNext
getFlags
setFlags
offsetGet
offsetSet
offsetUnset
offsetExists
getCache
getIteratorIndex
getArrayIterator
getMode
setMode
getPregFlags
setPregFlags
max_depth
newval
preg_flags
Accessing the value of an EmptyIterator
Accessing the key of an EmptyIterator
Objects returned by RecursiveIterator::getChildren() must implement RecursiveIterator
The %s instance wasn't initialized properly
Parameter max_depth must be >= -1
Classes derived from %s must call %s::__construct()
An instance of RecursiveIterator or IteratorAggregate creating it is required
%s::getIterator() must be called exactly once per instance
Parameter count must either be -1 or a value greater than or equal 0
Class to downcast to not found or not base class or does not implement Traversable
%s::getIterator() must return an object that implements Traversable
Flags must contain only one of CALL_TOSTRING, TOSTRING_USE_KEY, TOSTRING_USE_CURRENT, TOSTRING_USE_CURRENT
%v does not use a full cache (see CachingIterator::__construct)
Unsetting flag CALL_TO_STRING is not possible
Unsetting flag TOSTRING_USE_INNER is not possible
Flags must contain only one of CALL_TOSTRING, TOSTRING_USE_KEY, TOSTRING_USE_CURRENT, TOSTRING_USE_INNER
%s does not use a full cache (see CachingIterator::__construct)
%s does not fetch string value (see CachingIterator::__construct)
The inner constructor wasn't initialized with an iterator instance
Cannot seek to %ld which is below the offset %ld
Cannot seek to %ld which is behind offset %ld plus count %ld
ArrayObject
RecursiveArrayIterator
STD_PROP_LIST
ARRAY_AS_PROPS
Illegal offset type
Undefined offset:  %ld
natcasesort
natsort
uksort
uasort
offsetget
offsetset
offsetexists
offsetunset
getArrayCopy
getIterator
exchangeArray
setIteratorClass
getIteratorClass
cmp_function
iteratorClass
An offset must not begin with \0 or be empty
Cannot append properties to objects, use %s::offsetSet() instead
Function expects exactly one argument
ArrayIterator::rewind(): Array was modified outside object and is no longer an array
Passed variable is not an array or object, using empty array instead
Overloaded object of type %s is not compatible with %s
Internal compiler error, Class is not child of ArrayObject or ArrayIterator
ArrayIterator::current(): Array was modified outside object and is no longer an array
ArrayIterator::current(): Array was modified outside object and internal position is no longer valid
ArrayIterator::valid(): Array was modified outside object and is no longer an array
ArrayIterator::valid(): Array was modified outside object and internal position is no longer valid
Seek position %ld is out of range
ArrayIterator::next(): Array was modified outside object and internal position is no longer valid
Cannot open file '%s'
getcurrentline
SplFileInfo
RecursiveDirectoryIterator
CURRENT_MODE_MASK
CURRENT_AS_PATHNAME
CURRENT_AS_FILEINFO
CURRENT_AS_SELF
KEY_MODE_MASK
KEY_AS_PATHNAME
FOLLOW_SYMLINKS
KEY_AS_FILENAME
NEW_CURRENT_AND_KEY
SplFileObject
DROP_NEW_LINE
READ_AHEAD
SKIP_EMPTY
READ_CSV
SplTempFileObject
enclosure must be a character
delimiter must be a character
Cannot read from file %s
Can't truncate file %s
php://memory
php://temp/maxmemory:%ld
php://temp
getCurrentLine
Cannot rewind file %s
fscanf
fgetss
Could not open file
Object not initialized
Operation not supported
getPath
getFilename
getBasename
getPathname
getPerms
getInode
getSize
getOwner
getGroup
getATime
getMTime
getCTime
getType
isWritable
isReadable
isExecutable
isFile
isLink
getLinkTarget
getRealPath
getFileInfo
getPathInfo
openFile
setFileClass
setInfoClass
getSubPath
getSubPathname
fgetcsv
setCsvControl
getCsvControl
fflush
fpassthru
fwrite
ftruncate
setMaxLineLen
getMaxLineLen
suffix
open_mode
use_include_path
allow_links
enclosure
operation
wouldblock
whence
allowable_tags
line_pos
max_memory
Maximum line length must be greater than or equal zero
An object of class %s cannot be cloned
Directory name must not be empty.
Unable to read link %s, error: %s
Can't seek file %s to negative line %ld
simplexmlelement
SimpleXMLIterator
LogicException
BadFunctionCallException
BadMethodCallException
DomainException
InvalidArgumentException
LengthException
OutOfRangeException
RuntimeException
OutOfBoundsException
OverflowException
UnderflowException
UnexpectedValueException
SplObserver
SplSubject
SplObjectStorage
attach
detach
notify
contains
unserialize
serialized
Empty serialized string cannot be empty
Error at offset %ld of %d bytes
[:<:]]
[:>:]]
abcdefghijklmnopqrstuvwxyz
ABCDEFGHIJKLMNOPQRSTUVWXYZ
0123456789ABCDEFabcdef
backspace
newline
vertical-tab
form-feed
carriage-return
exclamation-mark
quotation-mark
number-sign
dollar-sign
percent-sign
ampersand
apostrophe
left-parenthesis
right-parenthesis
asterisk
plus-sign
hyphen
hyphen-minus
period
full-stop
semicolon
less-than-sign
equals-sign
greater-than-sign
question-mark
commercial-at
left-square-bracket
backslash
reverse-solidus
right-square-bracket
circumflex
circumflex-accent
underscore
low-line
grave-accent
left-brace
left-curly-bracket
vertical-line
right-brace
right-curly-bracket
ABCDEFGHIJKLMNOPQRSTUVWXYZabcdefghijklmnopqrstuvwxyz0123456789
ABCDEFGHIJKLMNOPQRSTUVWXYZabcdefghijklmnopqrstuvwxyz
ABCDEFGHIJKLMNOPQRSTUVWXYZabcdefghijklmnopqrstuvwxyz0123456789!"#$%&'()*+,-./:;<=>?@[\]^_`{|}~
ABCDEFGHIJKLMNOPQRSTUVWXYZabcdefghijklmnopqrstuvwxyz0123456789!"#$%&'()*+,-./:;<=>?@[\]^_`{|}~ 
!"#$%&'()*+,-./:;<=>?@[\]^_`{|}~
REG_0x%x
REG_OKAY
no errors detected
REG_NOMATCH
regexec() failed to match
REG_BADPAT
invalid regular expression
REG_ECOLLATE
invalid collating element
REG_ECTYPE
invalid character class
REG_EESCAPE
trailing backslash (\)
REG_ESUBREG
invalid backreference number
REG_EBRACK
brackets ([ ]) not balanced
REG_EPAREN
parentheses not balanced
REG_EBRACE
braces not balanced
REG_BADBR
invalid repetition count(s)
REG_ERANGE
invalid character range
REG_ESPACE
out of memory
REG_BADRPT
REG_EMPTY
empty (sub)expression
REG_ASSERT
REG_INVARG
repetition-operator operand invalid
"can't happen" -- you found a bug
invalid argument to regex routine
*** unknown regexp error code ***
recursion detected
Array sizes are inconsistent
Not a valid callback %s
Argument #%d is not an array
Invalid comparison function
EXTR_OVERWRITE
EXTR_SKIP
EXTR_PREFIX_SAME
EXTR_PREFIX_ALL
EXTR_PREFIX_INVALID
EXTR_PREFIX_IF_EXISTS
EXTR_IF_EXISTS
EXTR_REFS
SORT_ASC
SORT_REGULAR
SORT_NUMERIC
SORT_STRING
SORT_LOCALE_STRING
CASE_LOWER
CASE_UPPER
COUNT_NORMAL
COUNT_RECURSIVE
Wrong data type for start key
Unknown extract type
GLOBALS
Unable to call %s()
zz/|z/
z/z/|z/
Size parameter expected to be greater than 0
The second argument should be either an array or an object
The first argument should be either a string or an integer
The first argument should be an array
The second argument, '%s', should be a valid callback
An error occurred while invoking the filter callback
The argument should be an array
First argument should be an array
Cannot add element to the array as the next element is already occupied
Passed variable is not an array or object
Argument #%d is expected to be an array or sorting flag that has not already been specified
Argument #%d is an unknown sort flag
Argument #%d is expected to be an array or a sort flag
Array was modified by the user comparison function
Both parameters should have an equal number of elements
Both parameters should have at least 1 element
The first argument, '%s', should be either NULL or a valid callback
Argument #%d should be an array
An error occurred while invoking the map callback
An error occurred while invoking the reduction callback
First argument has to be an array
Second argument has to be between 1 and the number of elements in the array
You may only pad up to 1048576 elements at a time
Number of elements must be positive
Prefix expected to be specified
Wrong datatype for second argument
Wrong syntax for function name
At least one value should be passed
Array must contain at least one element
data_compare_type is %d. This should never happen. Please report as a bug
data_compare_type is %d. key_compare_type is %d. This should never happen. Please report as a bug
behavior is %d. This should never happen. Please report as a bug
Can only flip STRING and INTEGER values!
Can only count STRING and INTEGER values!
step exceeds the specified range
2147483648
ABCDEFGHIJKLMNOPQRSTUVWXYZabcdefghijklmnopqrstuvwxyz0123456789+/
(knNUnable to delete tick function executed at the moment
Invalid shutdown callback '%s' passed
Sleep until to time is less than current time
The seconds value must be greater than 0
The nanoseconds value must be greater than 0
nanoseconds was not in the range 0 to 999 999 999 or seconds was negative
Number of microseconds must be greater than or equal to 0
Number of seconds must be greater than or equal to 0
Numeric key detected - possible security hazard
Attempted GLOBALS variable overwrite
Attempted super-global (%s) variable overwrite
Attempted long input array (%s) overwrite
Unable to call %s::%s() - function does not exist
(Registered shutdown functions) Unable to call %s() - function does not exist
No prefix specified - possible security hazard
Second argument is not an object or class name
First argument is expected to be a valid callback, '%s' was given
Safe Mode warning: Cannot override protected environment variable '%s'
Safe Mode warning: Cannot set environment variable '%s' - it's not in the allowed list
No support for long options in this build
SORT_REGULAR_or_SORT_NUMERIC_or_SORT_STRING
highlight.comment
highlight.default
highlight.html
highlight.keyword
highlight.string
Unable to find extension '%s'
global_value
local_value
access
PHP error_log message
TCP/IP option not available!
nanoseconds
Invalid in_addr value
An unknown error occured
Unrecognized address %s
Couldn't find constant %s
CONNECTION_ABORTED
CONNECTION_NORMAL
CONNECTION_TIMEOUT
INI_USER
INI_PERDIR
INI_SYSTEM
INI_ALL
PHP_URL_SCHEME
PHP_URL_HOST
PHP_URL_PORT
PHP_URL_USER
PHP_URL_PASS
PHP_URL_PATH
PHP_URL_QUERY
PHP_URL_FRAGMENT
M_LOG2E
M_LOG10E
M_LN10
M_PI_2
M_PI_4
M_1_PI
M_2_PI
M_SQRTPI
M_2_SQRTPI
M_LNPI
M_EULER
M_SQRT2
M_SQRT1_2
M_SQRT3
HTTP_POST_VARS
HTTP_GET_VARS
HTTP_COOKIE_VARS
HTTP_ENV_VARS
HTTP_SERVER_VARS
HTTP_RAW_POST_DATA
HTTP_POST_FILES
Unable to call tick function
Unable to move '%s' to '%s'
ignore_user_abort
error_log
java.class.path
java.home
java.library.path
vpopmail.directory
max_execution_time
memory_limit
child_terminate
highlighted code
Unable to call %s(%s,%s)
Unable to call %s(%s)
Argument 1 invalid
Invalid arguments
Invalid parameter syntax
bin2hex
usleep
time_nanosleep
time_sleep_until
strptime
wordwrap
htmlspecialchars
htmlentities
html_entity_decode
htmlspecialchars_decode
get_html_translation_table
sha1_file
md5_file
iptcparse
iptcembed
getimagesize
image_type_to_mime_type
image_type_to_extension
phpinfo
phpversion
phpcredits
php_logo_guid
php_real_logo_guid
zend_logo_guid
php_sapi_name
php_uname
php_ini_scanned_files
php_ini_loaded_file
strnatcmp
strnatcasecmp
substr_count
strspn
strcspn
strtok
strtoupper
strtolower
stripos
strripos
strrev
hebrev
hebrevc
basename
dirname
pathinfo
stripslashes
stripcslashes
strstr
stristr
strrchr
str_shuffle
str_word_count
str_split
strpbrk
substr_compare
strcoll
money_format
substr_replace
quotemeta
ucfirst
ucwords
addslashes
addcslashes
str_ireplace
str_repeat
count_chars
chunk_split
similar_text
explode
implode
setlocale
localeconv
nl_langinfo
soundex
levenshtein
parse_str
str_pad
strchr
vprintf
vsprintf
vfprintf
sscanf
parse_url
rawurlencode
rawurldecode
http_build_query
readlink
linkinfo
symlink
unlink
escapeshellcmd
escapeshellarg
shell_exec
proc_open
proc_close
proc_terminate
proc_get_status
proc_nice
mt_rand
mt_srand
mt_getrandmax
getservbyname
getservbyport
getprotobyname
getprotobynumber
getmyuid
getmygid
getmypid
getmyinode
getlastmod
base64_decode
base64_encode
convert_uuencode
convert_uudecode
is_finite
is_nan
is_infinite
deg2rad
rad2deg
bindec
hexdec
octdec
decbin
decoct
dechex
base_convert
number_format
inet_ntop
inet_pton
ip2long
long2ip
getenv
putenv
sys_getloadavg
microtime
gettimeofday
getrusage
uniqid
quoted_printable_decode
convert_cyr_string
get_current_user
set_time_limit
get_cfg_var
set_magic_quotes_runtime
get_magic_quotes_gpc
get_magic_quotes_runtime
import_request_variables
error_get_last
call_user_func
call_user_func_array
call_user_method
call_user_method_array
var_dump
var_export
debug_zval_dump
print_r
memory_get_usage
memory_get_peak_usage
register_shutdown_function
unregister_tick_function
highlight_file
show_source
highlight_string
php_strip_whitespace
ini_get
ini_get_all
ini_set
ini_alter
ini_restore
get_include_path
set_include_path
restore_include_path
setcookie
setrawcookie
headers_sent
headers_list
connection_aborted
connection_status
parse_ini_file
is_uploaded_file
move_uploaded_file
gethostbyaddr
gethostbyname
gethostbynamel
dns_check_record
checkdnsrr
dns_get_mx
getmxrr
dns_get_record
floatval
doubleval
gettype
settype
is_null
is_resource
is_bool
is_long
is_float
is_int
is_integer
is_double
is_real
is_numeric
is_string
is_array
is_object
is_scalar
is_callable
ereg_replace
eregi_replace
spliti
sql_regcase
pclose
readfile
fclose
tempnam
tmpfile
file_get_contents
file_put_contents
stream_select
stream_context_create
stream_context_set_params
stream_context_set_option
stream_context_get_options
stream_context_get_default
stream_filter_prepend
stream_filter_append
stream_filter_remove
stream_socket_client
stream_socket_server
stream_socket_accept
stream_socket_get_name
stream_socket_recvfrom
stream_socket_sendto
stream_socket_enable_crypto
stream_socket_shutdown
stream_socket_pair
stream_copy_to_stream
stream_get_contents
fputcsv
get_meta_tags
stream_set_write_buffer
set_file_buffer
set_socket_blocking
stream_set_blocking
socket_set_blocking
stream_get_meta_data
stream_get_line
stream_wrapper_register
stream_register_wrapper
stream_wrapper_unregister
stream_wrapper_restore
stream_get_wrappers
stream_get_transports
stream_is_local
get_headers
stream_set_timeout
socket_set_timeout
socket_get_status
realpath
fnmatch
pfsockopen
unpack
get_browser
getcwd
scandir
fileatime
filectime
filegroup
fileinode
filemtime
fileowner
fileperms
filetype
file_exists
is_writable
is_writeable
is_readable
is_executable
is_file
is_dir
is_link
lchown
lchgrp
clearstatcache
disk_total_space
disk_free_space
diskfreespace
ezmlm_hash
openlog
syslog
closelog
define_syslog_variables
lcg_value
metaphone
ob_start
ob_flush
ob_clean
ob_end_flush
ob_end_clean
ob_get_flush
ob_get_clean
ob_get_length
ob_get_level
ob_get_status
ob_get_contents
ob_implicit_flush
ob_list_handlers
krsort
arsort
array_walk
array_walk_recursive
in_array
array_search
extract
compact
array_fill
array_fill_keys
array_multisort
array_push
array_pop
array_shift
array_unshift
array_splice
array_slice
array_merge
array_merge_recursive
array_keys
array_values
array_count_values
array_reverse
array_reduce
array_pad
array_flip
array_change_key_case
array_rand
array_unique
array_intersect
array_intersect_key
array_intersect_ukey
array_uintersect
array_intersect_assoc
array_uintersect_assoc
array_intersect_uassoc
array_uintersect_uassoc
array_diff
array_diff_key
array_diff_ukey
array_udiff
array_diff_assoc
array_udiff_assoc
array_diff_uassoc
array_udiff_uassoc
array_sum
array_product
array_filter
array_map
array_chunk
array_combine
array_key_exists
sizeof
assert
assert_options
version_compare
str_rot13
stream_get_filters
stream_filter_register
stream_bucket_make_writeable
stream_bucket_prepend
stream_bucket_append
stream_bucket_new
output_add_rewrite_var
output_reset_rewrite_vars
sys_get_temp_dir
safe_mode_protected_env_vars
LD_LIBRARY_PATH
safe_mode_allowed_env_vars
const_name
micro_seconds
quote_style
double_encode
iptcdata
jpeg_file_name
include_dot
max_chars_per_line
charlist
split_length
char_list
main_str
case_sensitivity
character_mask
replace_count
chunklen
ending
percent
pieces
cost_ins
cost_rep
cost_del
codepoint
result
pad_length
pad_string
pad_type
component
formdata
prefix
arg_separator
target
return_value
descriptorspec
other_options
process
service
protocol
strict
exponent
binary_number
hexadecimal_number
octal_number
frombase
tobase
num_decimal_places
dec_seperator
thousands_seperator
in_addr
ip_address
proper_address
varname
get_as_float
more_entropy
option_name
message_type
destination
extra_headers
function_name
parmeter
method_name
variable_representation
real_usage
newvalue
new_include_path
expires
http_response_code
process_sections
new_path
hostname
mxhosts
weight
authns
syntax_only
callable_name
registers
extension_filename
pathname
old_name
new_name
source_file
destination_file
maxlen
read_streams
write_streams
except_streams
stream_or_context
wrappername
optionname
filtername
read_write
filterparams
stream_filter
remoteaddress
errcode
errstring
localaddress
serverstream
want_peer
amount
remote_addr
target_addr
enable
cryptokind
sessionstream
fields
classname
microseconds
browser_name
return_array
dir_handle
sorting_order
additional_headers
additional_parameters
facility
phones
user_function
chunk_size
full_status
sort_flags
funcname
userdata
extract_type
var_names
start_key
SORT_ASC_or_SORT_DESC
preserve_keys
search_value
initial
pad_size
pad_value
num_req
callback_key_compare_func
callback_data_compare_func
callback_key_comp_func
callback_data_comp_func
assertion
2147483648
browser_name_pattern
browser_name_regex
browscap
Cannot open '%s' for reading
HTTP_USER_AGENT
browscap ini directive not set
HTTP_USER_AGENT variable is not set, cannot determine user agent name
Default Browser Capability Settings
Qkkbal
-CRYPT_SALT_LENGTH
CRYPT_STD_DES
CRYPT_EXT_DES
CRYPT_MD5
CRYPT_BLOWFISH
./0123456789ABCDEFGHIJKLMNOPQRSTUVWXYZabcdefghijklmnopqrstuvwxyz
Unknown source charset: %c
Unknown destination charset: %c
 !"#$%&'()*+,-./0123456789:;<=>?@ABCDEFGHIJKLMNOPQRSTUVWXYZ[\]^_`abcdefghijklmnopqrstuvwxyz{|}~
................................
 !"#$%&'()*+,-./0123456789:;<=>?@ABCDEFGHIJKLMNOPQRSTUVWXYZ[\]^_`abcdefghijklmnopqrstuvwxyz{|}~
                                   
 !"#$%&'()*+,-./0123456789:;<=>?@ABCDEFGHIJKLMNOPQRSTUVWXYZ[\]^_`abcdefghijklmnopqrstuvwxyz{|}~
###||||++||++++++--|-+||++--|-+----++++++++##||#
 !"#$%&'()*+,-./0123456789:;<=>?@ABCDEFGHIJKLMNOPQRSTUVWXYZ[\]^_`abcdefghijklmnopqrstuvwxyz{|}~
                                
 !"#$%&'()*+,-./0123456789:;<=>?@ABCDEFGHIJKLMNOPQRSTUVWXYZ[\]^_`abcdefghijklmnopqrstuvwxyz{|}~
                                 
              
              
 !"#$%&'()*+,-./0123456789:;<=>?@ABCDEFGHIJKLMNOPQRSTUVWXYZ[\]^_`abcdefghijklmnopqrstuvwxyz{|}~
                                   
               
            
 !"#$%&'()*+,-./0123456789:;<=>?@ABCDEFGHIJKLMNOPQRSTUVWXYZ[\]^_`abcdefghijklmnopqrstuvwxyz{|}~
 !"#$%&'()*+,-./0123456789:;<=>?@ABCDEFGHIJKLMNOPQRSTUVWXYZ[\]^_`abcdefghijklmnopqrstuvwxyz{|}~
unparsed
%s, %02d %s %04d %02d:%02d:%02d GMT
%s, %02d-%s-%02d %02d:%02d:%02d GMT
(errno %d): %s
Directory
%s (errno %d)
DIRECTORY_SEPARATOR
PATH_SEPARATOR
GLOB_BRACE
GLOB_MARK
GLOB_NOSORT
GLOB_NOCHECK
GLOB_NOESCAPE
GLOB_ERR
GLOB_ONLYDIR
GLOB_AVAILABLE_FLAGS
Directory name cannot be empty
Unable to find my handle property
%d is not a valid Directory resource
Pattern exceeds the maximum allowed length of %d characters
At least one of the passed flags is invalid or not supported on this platform
Dynamic Library Support
extension_dir
_get_module
Temporary module name should contain only filename
Unable to load dynamic library '%s' - %s
Invalid library (maybe not a PHP library) '%s' 
%s: Unable to initialize module
Module compiled with module API=%d, debug=%d, thread-safety=%d
PHP    compiled with module API=%d, debug=%d, thread-safety=%d
These options need to match
Unable to initialize module '%s'
Dynamically loaded extensions aren't enabled
Dynamically loaded extensions aren't allowed when running in Safe Mode
File name exceeds the maximum allowed length of %d characters
dl() is deprecated - use extension=%s in your php.ini
%d.%d.%d.%d
serial
refresh
minimum-ttl
masklen
services
DNS_NS
DNS_CNAME
DNS_SOA
DNS_PTR
DNS_HINFO
DNS_MX
DNS_TXT
DNS_SRV
DNS_NAPTR
DNS_AAAA
DNS_A6
DNS_ANY
DNS_ALL
Host cannot be empty
Host and type cannot be empty
Type '%s' not supported
Type '%d' not supported
res_nmkquery() failed
res_nsend() failed
Address is not a valid IPv4 or IPv6 address
Unable to parse DNS data received
Unable to execute '%s'
Unable to fork [%s]
s|z/z/
Only a super user may attempt to increase the priority of a process
Cannot execute using backquotes in Safe Mode
No '..' components allowed in path
Cannot execute a blank command
blksize
Wrapper
%s does not allow unlinking
s|br!ll
'%ld' flag is not supported
stream-context
SEEK_SET
SEEK_CUR
SEEK_END
LOCK_SH
LOCK_EX
LOCK_UN
LOCK_NB
STREAM_NOTIFY_CONNECT
STREAM_NOTIFY_AUTH_REQUIRED
STREAM_NOTIFY_AUTH_RESULT
STREAM_NOTIFY_MIME_TYPE_IS
STREAM_NOTIFY_FILE_SIZE_IS
STREAM_NOTIFY_REDIRECTED
STREAM_NOTIFY_PROGRESS
STREAM_NOTIFY_FAILURE
STREAM_NOTIFY_COMPLETED
STREAM_NOTIFY_RESOLVE
STREAM_NOTIFY_SEVERITY_INFO
STREAM_NOTIFY_SEVERITY_WARN
STREAM_NOTIFY_SEVERITY_ERR
STREAM_FILTER_READ
STREAM_FILTER_WRITE
STREAM_FILTER_ALL
STREAM_CLIENT_PERSISTENT
STREAM_CLIENT_ASYNC_CONNECT
STREAM_CLIENT_CONNECT
STREAM_SHUT_RD
STREAM_SHUT_WR
STREAM_SHUT_RDWR
STREAM_PF_INET
STREAM_PF_INET6
STREAM_PF_UNIX
STREAM_IPPROTO_IP
STREAM_IPPROTO_TCP
STREAM_IPPROTO_UDP
STREAM_IPPROTO_ICMP
STREAM_IPPROTO_RAW
STREAM_SOCK_STREAM
STREAM_SOCK_DGRAM
STREAM_SOCK_RAW
STREAM_SOCK_SEQPACKET
STREAM_SOCK_RDM
STREAM_PEEK
STREAM_OOB
STREAM_SERVER_BIND
STREAM_SERVER_LISTEN
FILE_USE_INCLUDE_PATH
FILE_IGNORE_NEW_LINES
FILE_SKIP_EMPTY_LINES
FILE_APPEND
FILE_NO_DEFAULT_CONTEXT
FILE_TEXT
FILE_BINARY
FNM_NOESCAPE
FNM_PATHNAME
FNM_PERIOD
FNM_CASEFOLD
.\+*?[^]$() 
content
Can't truncate this stream!
Illegal operation argument
sz/|lr!
File-Handle
user_agent
default_socket_timeout
auto_detect_line_endings
Filename exceeds the maximum allowed length of %d characters
The first argument to copy() function cannot be a directory
Unable to locate stream wrapper
%s wrapper does not support renaming
Cannot rename a file across wrapper types
%d is not a valid stream resource
Failed to seek to position %ld in the stream
STREAM_CRYPTO_METHOD_SSLv2_CLIENT
STREAM_CRYPTO_METHOD_SSLv3_CLIENT
STREAM_CRYPTO_METHOD_SSLv23_CLIENT
STREAM_CRYPTO_METHOD_TLS_CLIENT
STREAM_CRYPTO_METHOD_SSLv2_SERVER
STREAM_CRYPTO_METHOD_SSLv3_SERVER
STREAM_CRYPTO_METHOD_SSLv23_SERVER
STREAM_CRYPTO_METHOD_TLS_SERVER
delimiter must be a single character
enclosure must be a single character
Length parameter must be greater than 0
Length parameter may not be negative
Only %d of %d bytes written, possibly out of free disk space
Failed to write %d bytes to %s
%sstat failed for %s
Unknown file type (%d)
unknown
Didn't understand stat call
Unable to find gid for %s
Utime failed: %s
Unable to find uid for %s
Unable to create file %s because %s
Field width %d is too long
Too few arguments
Argument number must be greater than zero
Width must be greater than zero and less than %d
Precision must be greater than zero and less than %d
Requested precision of %d digits was truncated to PHP maximum of %d digits
s|lzzd
pfsockopen__%s:%ld
unable to connect to %s:%ld (%s)
Set-Cookie: %s=%s
; expires=
; path=
; domain=
; secure
; httponly
s|slssbb
Cookie names can not contain any of the following '=,; \t\r\n\013\014'
Cookie values can not contain any of the following ',; \t\r\n\013\014'
Set-Cookie: %s=deleted; expires=%s
Expiry date cannot have a year greater then 9999
mb_internal_encoding
HTML_SPECIALCHARS
HTML_ENTITIES
ENT_COMPAT
ENT_QUOTES
ENT_NOQUOTES
s|ls!b
cannot yet handle MBCS!
&quot;
&#039;
ISO8859-1
ISO8859-15
cp1252
Windows-1252
GB2312
BIG5-HKSCS
Shift_JIS
EUC-JP
KOI8-R
koi8-ru
cp1251
Windows-1251
win-1251
iso8859-5
iso-8859-5
ibm866
MacRoman
hellip
dagger
Dagger
permil
Scaron
lsaquo
scaron
rsaquo
curren
brvbar
plusmn
middot
frac14
frac12
frac34
iquest
Agrave
Aacute
Atilde
Ccedil
Egrave
Eacute
Igrave
Iacute
Ntilde
Ograve
Oacute
Otilde
Oslash
Ugrave
Uacute
Yacute
agrave
aacute
atilde
ccedil
egrave
eacute
igrave
iacute
ntilde
ograve
oacute
otilde
divide
oslash
ugrave
uacute
yacute
Epsilon
Lambda
Omicron
Upsilon
epsilon
lambda
omicron
sigmaf
upsilon
thetasym
thinsp
weierp
alefsym
forall
nexist
coprod
mnplus
plusdo
lowast
compfn
angmsd
angsph
conint
there4
becaus
wreath
otimes
lfloor
rfloor
spades
hearts
#xFB01
#xFB02
#xF8FF
charset `%s' not supported, assuming iso-8859-1
Invalid multibyte sequence in argument
image/xbm
application/octet-stream
image/gif
image/jpeg
image/png
application/x-shockwave-flash
image/psd
image/bmp
image/tiff
image/iff
image/vnd.wap.wbmp
image/jp2
#define %s %d
Read error!
IMAGETYPE_GIF
IMAGETYPE_JPEG
IMAGETYPE_PNG
IMAGETYPE_SWF
IMAGETYPE_PSD
IMAGETYPE_BMP
IMAGETYPE_TIFF_II
IMAGETYPE_TIFF_MM
IMAGETYPE_JPC
IMAGETYPE_JP2
IMAGETYPE_JPX
IMAGETYPE_JB2
IMAGETYPE_SWC
IMAGETYPE_IFF
IMAGETYPE_WBMP
IMAGETYPE_JPEG2000
IMAGETYPE_XBM
channels
GIF8BPSBMFWSCWS
JPEG2000 codestream corrupt(Expected SIZ marker not found after SOC)
PNG file corrupted by ASCII conversion
JP2 file has no codestreams at root level
PHPE9568F35-D428-11d2-A769-00AA001ACF42
PHPE9568F34-D428-11d2-A769-00AA001ACF42
<tr class="h"><th colspan="%d">%s</th></tr>
 _______________________________________________________________________
<table border="0" cellpadding="3" width="600">
<h2><a name="module_%s">%s</a></h2>
Linux build32.lxcenter.org 2.6.18-348.4.1.el5.028stab107.2 #1 SMP Mon Jul 1 22:13:01 MSD 2013 i686 i686 i386 GNU/Linux
<!DOCTYPE html PUBLIC "-//W3C//DTD XHTML 1.0 Transitional//EN" "DTD/xhtml1-transitional.dtd">
<html xmlns="http://www.w3.org/1999/xhtml">>
<meta name="ROBOTS" content="NOINDEX,NOFOLLOW,NOARCHIVE" />
<a href="http://www.php.net/"><img border="0" src="
<h1 class="p">PHP Version %s</h1>
 './configure'  '--build=i686-redhat-linux-gnu' '--host=i686-redhat-linux-gnu' '--target=i386-redhat-linux-gnu' '--program-prefix=' '--prefix=/usr' '--exec-prefix=/usr' '--bindir=/usr/bin' '--sbindir=/usr/sbin' '--sysconfdir=/etc' '--datadir=/usr/share' '--includedir=/usr/include' '--libdir=/usr/lib' '--libexecdir=/usr/libexec' '--localstatedir=/var' '--sharedstatedir=/usr/com' '--mandir=/usr/share/man' '--infodir=/usr/share/info' '--cache-file=../config.cache' '--with-libdir=lib' '--with-config-file-path=/etc' '--with-config-file-scan-dir=/etc/php.d' '--disable-debug' '--with-pic' '--disable-rpath' '--without-pear' '--with-bz2' '--with-exec-dir=/usr/bin' '--with-freetype-dir=/usr' '--with-png-dir=/usr' '--with-xpm-dir=/usr' '--enable-gd-native-ttf' '--with-t1lib=/usr' '--without-gdbm' '--with-gettext' '--with-gmp' '--with-iconv' '--with-jpeg-dir=/usr' '--with-openssl' '--with-pcre-regex=/usr' '--with-zlib' '--with-layout=GNU' '--enable-exif' '--enable-ftp' '--enable-magic-quotes' '--enable-sockets' '--enable-sysvsem' '--enable-sysvshm' '--enable-sysvmsg' '--with-kerberos' '--enable-ucd-snmp-hack' '--enable-shmop' '--enable-calendar' '--without-mime-magic' '--without-sqlite' '--with-libxml-dir=/usr' '--enable-xml' '--with-system-tzdata' '--enable-force-cgi-redirect' '--enable-pcntl' '--with-imap=shared' '--with-imap-ssl' '--enable-mbstring=shared' '--enable-mbregex' '--with-ncurses=shared' '--with-gd=shared' '--enable-bcmath=shared' '--enable-dba=shared' '--with-db4=/usr' '--with-xmlrpc=shared' '--with-ldap=shared' '--with-ldap-sasl' '--with-mysql=shared,/usr' '--with-mysqli=shared,/usr/bin/mysql_config' '--enable-dom=shared' '--with-pgsql=shared' '--enable-wddx=shared' '--with-snmp=shared,/usr' '--enable-soap=shared' '--with-xsl=shared,/usr' '--enable-xmlreader=shared' '--enable-xmlwriter=shared' '--with-curl=shared,/usr' '--enable-fastcgi' '--enable-pdo=shared' '--with-pdo-odbc=shared,unixODBC,/usr' '--with-pdo-mysql=shared,/usr' '--with-pdo-pgsql=shared,/usr' '--with-pdo-sqlite=shared,/usr' '--with-pdo-dblib=shared,/usr' '--enable-json=shared' '--enable-zip=shared' '--with-readline' '--enable-dbase=shared' '--with-pspell=shared' '--with-mcrypt=shared,/usr' '--with-mhash=shared,/usr' '--with-tidy=shared,/usr' '--with-mssql=shared,/usr' '--enable-sysvmsg=shared' '--enable-sysvshm=shared' '--enable-sysvsem=shared' '--enable-posix=shared' '--with-unixODBC=shared,/usr' '--with-recode=shared,/usr' '--with-libevent=shared' '--with-fpm' '--with-fpm-bin=/usr/bin/php-cgi' '--with-fpm-port=9000' '--with-fpm-conf=/etc/php-fpm.conf' '--with-fpm-log=/var/log/php-fpm.log' '--with-fpm-pid=/var/run/php-fpm.pid' '--with-fpm-user=nobody' '--with-fpm-group=nobody' '--with-interbase=shared,/usr/lib/firebird' '--with-pdo-firebird=shared,/usr/lib/firebird}'
Configuration File (php.ini) Path
Scan this dir for additional .ini files
Registered Stream Socket Transports
<a href="http://www.zend.com/"><img border="0" src="
?=PHPE9568F35-D428-11d2-A769-00AA001ACF42" alt="Zend logo" /></a>
This program makes use of the Zend Scripting Language Engine:
?=PHPB8B5F2A0-3C92-11d3-A3A9-4C7B08C10000">
This program is free software; you can redistribute it and/or modify 
it under the terms of the PHP License as published by the PHP Group 
and included in the distribution in the file:  LICENSE
This program is distributed in the hope that it will be useful, 
but WITHOUT ANY WARRANTY; without even the implied warranty of 
MERCHANTABILITY or FITNESS FOR A PARTICULAR PURPOSE.
If you did not receive a copy of the PHP license, or have any questions about 
This program is free software; you can redistribute it and/or modify
it under the terms of the PHP License as published by the PHP Group
This program is distributed in the hope that it will be useful,
but WITHOUT ANY WARRANTY; without even the implied warranty of
If you did not receive a copy of the PHP license, or have any
questions about PHP licensing, please contact license@php.net.
INFO_GENERAL
INFO_CREDITS
INFO_CONFIGURATION
INFO_MODULES
INFO_ENVIRONMENT
INFO_VARIABLES
INFO_LICENSE
INFO_ALL
CREDITS_GROUP
CREDITS_GENERAL
CREDITS_SAPI
CREDITS_MODULES
CREDITS_DOCS
CREDITS_FULLPAGE
CREDITS_QA
CREDITS_ALL
%*s%s%*s
<hr />
</table><br />
</td></tr>
<tr class="h"><td>
<tr class="v"><td>
<tr class="h">
<td class="%s">
<i>no value</i>
 </td>
<td class="e">
</td><td class="v">
</pre>
%s %s %s %s %s
<style type="text/css">
</style>
<head>
<title>phpinfo()</title>
</head>
<body><div class="center">
expose_php
phpinfo()
" alt="PHP Logo" /></a>
PHP Version
System
Dec 18 2013 16:45:54
Build Date
Configure Command
Server API
Virtual Directory Support
(none)
Loaded Configuration File
additional .ini files parsed
PHP API
PHP Extension
Zend Extension
Debug Build
Thread Safety
Zend Memory Manager
IPv6 Support
Registered PHP Streams
no streams registered
no transports registered
Stream Socket Transports
Registered Stream Filters
no filters registered
<br />
<h1><a href="
PHP Credits
</a></h1>
<h1>Configuration</h1>
<h2>PHP Core</h2>
PHP Core
<h2>Additional Modules</h2>
Additional Modules
Module Name
<h2>Environment</h2>
Environment
Variable
<h2>PHP Variables</h2>
PHP Variables
PHP_SELF
PHP_AUTH_TYPE
PHP_AUTH_USER
PHP_AUTH_PW
<h2>PHP License</h2>
PHP License
</div></body></html>
%d#%03d
Unable to open %s
>No such file or directory
Unable to link to a URL
Unable to symlink to a URL
sendmail_path
Path to sendmail
mail.log
To: %s
Subject: %s
mail.force_extra_parameters
sss|ss
mail() on [%s:%d]: To: %s -- Headers: %s
X-PHP-Originating-Script: %ld:%s
X-PHP-Originating-Script: %ld:%s
Permission denied: unable to execute shell to run mail delivery binary '%s'
Could not execute mail delivery program '%s'
SAFE MODE Restriction in effect.  The fifth parameter is disabled in SAFE MODE
Number too large
Invalid `from base' (%ld)
Invalid `to base' (%ld)
base must be greater than 0
!	@Number '%s' is too big to fit in long
0123456789abcdefghijklmnopqrstuvwxyz
0123456789abcdefghijklmnopqrstuvwxyz
0123456789abcdef
ru_oublock
ru_inblock
ru_msgsnd
ru_msgrcv
ru_maxrss
ru_ixrss
ru_idrss
ru_minflt
ru_majflt
ru_nsignals
ru_nvcsw
ru_nivcsw
ru_nswap
ru_utime.tv_usec
ru_utime.tv_sec
ru_stime.tv_usec
ru_stime.tv_sec
minuteswest
dsttime
%.8F %ld
Invalid format type %c
%.*s%d
Type %c: integer overflow
Type %c: outside of string
Type %c: '*' ignored
Type %c: not enough arguments
Type %c: too few arguments
Type %c: unknown format code
%d arguments unused
Type %c: illegal hex digit %c
Type %c: not enough input, need %d, have %d
Type %c: integer overflow in format string
Type %c: not enough characters in string
Bundled library enabled
Regex Library
Invalid Regular Expression
2ssl|lb
Item '%ld' is not valid
ABDAY_1
ABDAY_2
ABDAY_3
ABDAY_4
ABDAY_5
ABDAY_6
ABDAY_7
ABMON_1
ABMON_2
ABMON_3
ABMON_4
ABMON_5
ABMON_6
ABMON_7
ABMON_8
ABMON_9
ABMON_10
ABMON_11
ABMON_12
AM_STR
PM_STR
T_FMT_AMPM
ERA_D_T_FMT
ERA_D_FMT
ERA_T_FMT
ALT_DIGITS
CRNCYSTR
RADIXCHAR
THOUSEP
YESEXPR
NOEXPR
CODESET
STR_PAD_LEFT
STR_PAD_RIGHT
STR_PAD_BOTH
PATHINFO_DIRNAME
PATHINFO_BASENAME
PATHINFO_EXTENSION
PATHINFO_FILENAME
CHAR_MAX
LC_CTYPE
LC_NUMERIC
LC_TIME
LC_COLLATE
LC_MONETARY
LC_ALL
LC_MESSAGES
int_curr_symbol
currency_symbol
mon_decimal_point
mon_thousands_sep
positive_sign
negative_sign
int_frac_digits
p_cs_precedes
p_sep_by_space
n_cs_precedes
n_sep_by_space
p_sign_posn
n_sign_posn
mon_grouping
Break string cannot be empty
Argument must be an array
Invalid arguments passed
Unknown mode
Empty delimiter
Empty substring
Invalid format value %ld
Invalid '..'-range
The length must be greater than zero
The start position cannot exceed initial string length
The length cannot exceed initial string length
The character list cannot be empty
The length of each segment must be greater than zero
Only a single %%i or %%n token can be used
Can't force cut when width is zero
Padding string cannot be empty
Padding type has to be STR_PAD_LEFT, STR_PAD_RIGHT, or STR_PAD_BOTH
Chunk length should be greater than zero
Offset is greater than the length of haystack string
Second argument has to be greater than or equal to 0
Passing locale category name as string is deprecated. Use the LC_* -constants instead
Invalid locale category name %s, must be one of LC_ALL, LC_COLLATE, LC_CTYPE, LC_MONETARY, LC_NUMERIC, or LC_TIME
Specified locale name is too long
The second argument is not an array
'from' and 'len' should be of same type - numerical or array 
'from' and 'len' should have the same number of elements
Functionality of 'from' and 'len' as arrays is not implemented
Offset not contained in string
needle is not a string or an integer
Offset should be greater than or equal to 0
Offset value %ld exceeds string length
Length should be greater than 0
Length value %ld exceeds string length
Invalid '..'-range, no character to the left of '..'
Invalid '..'-range, no character to the right of '..'
Invalid '..'-range, '..'-range needs to be incrementing
0123456789abcdef
HCcannot mix "%" and "%n$" conversion specifiers
Bad scan conversion character "%c"
Variable is assigned by multiple "%n$" conversion specifiers
Variable is not assigned by any conversion specifiers
"%n$" argument index out of range
Different numbers of variable names and field specifiers
Parameter %d must be passed by reference
Unmatched [ in format string
LOG_EMERG
LOG_ALERT
LOG_CRIT
LOG_ERR
LOG_WARNING
LOG_NOTICE
LOG_INFO
LOG_DEBUG
LOG_KERN
LOG_USER
LOG_MAIL
LOG_DAEMON
LOG_AUTH
LOG_SYSLOG
LOG_LPR
LOG_NEWS
LOG_UUCP
LOG_CRON
LOG_AUTHPRIV
LOG_LOCAL0
LOG_LOCAL1
LOG_LOCAL2
LOG_LOCAL3
LOG_LOCAL4
LOG_LOCAL5
LOG_LOCAL6
LOG_LOCAL7
LOG_PID
LOG_CONS
LOG_ODELAY
LOG_NDELAY
LOG_NOWAIT
LOG_PERROR
Only one argument expected
__PHP_Incomplete_Class
Invalid type
unknown type
Cannot convert to resource type
%s%08x%05x%.8F
%s%08x%05x
Unable to parse URL
fragment
Invalid URL component identifier %ld
0123456789ABCDEF
%sbool(%s) refcount(%u)
%sNULL refcount(%u)
%slong(%ld) refcount(%u)
%sdouble(%.*G) refcount(%u)
%sstring(%d) "
" refcount(%u)
*RECURSION*
%sarray(%d) refcount(%u){
%sUNKNOWN:0
%*c[%ld]=>
%*c["%s
:protected
:private
%sbool(%s)
%sNULL
%sint(%ld)
%sfloat(%.*G)
%sarray(%d) {
%sobject(%s)#%d (%d) {
%sresource(%ld) of type (%s)
' . "\0" . '
__sleep
__PHP_Incomplete_Class_Name
%sobject(%s)#%d (%d) refcount(%u){
%sresource(%ld) of type (%s) refcount(%u)
%sobject(unknown class)#%d (%d) {
__sleep should return an array only containing the names of instance-variables to serialize
"%s" returned as member variable from __sleep() but does not exist
assert code
Failure evaluating code: %s%s
Assertion "%s" failed
Assertion failed
ASSERT_ACTIVE
ASSERT_CALLBACK
ASSERT_BAIL
ASSERT_WARNING
ASSERT_QUIET_EVAL
Unknown value %ld
assert.active
assert.bail
assert.warning
assert.callback
assert.quiet_eval
/home/lxcenter/rpmbuild/BUILD/php-5.2.17/ext/standard/assert.c
Argument string(s) too long
The general Levenshtein support is not there yet
The script tried to execute a method or access a property of an incomplete object. Please ensure that the class definition "%s" of the object you are trying to operate on was loaded _before_ unserialize() gets called or provide a __autoload() function to load the class definition 
fieldset
url_rewriter.tags
a=href,area=href,frame=src,form=,fieldset=
FTP server error %d:%s
tcp://%s:%d
AUTH TLS
AUTH SSL
Unable to activate SSL mode
PBSZ 0
PROT P
Invalid login %s
USER %s
USER anonymous
Invalid password %s
PASS %s
PASS anonymous
Unable to connect to %s
Invalid path provided in %s
RMD %s
MKD %s
CWD %s
RNFR %s
Error Renaming file: %s
RNTO %s
DELE %s
Error Deleting file: %s
TYPE I
SIZE %s
MDTM %s
TYPE A
NLST %s
FTP server reports %s
Unknown file open mode
overwrite
REST %ld
ftpdir
FTP does not support simultaneous read/write connections
FTP proxy may only be used in read mode
Remote file already exists and overwrite context option not specified
Unable to resume from offset %d
Redirection limit reached, aborting
HTTP wrapper does not support writeable connections
Cannot connect to HTTPS server through proxy
Cannot construct User-agent header
Content-Type: application/x-www-form-urlencoded
Content-type not specified assuming application/x-www-form-urlencoded
HTTP request failed, unexpected end of socket!
%s://%s:%d
max_redirects
protocol_version
request_fulluri
 HTTP/
 HTTP/1.0
content-length:
content-type:
user-agent:
authorization:
Authorization: Basic %s
From: %s
Host: %s:%i
Host: %s
User-Agent: %s
Content-Length: %d
http_response_header
ignore_errors
Location: 
Content-Type: 
Content-Length: 
http://
https://
ftp://
ftps://
%s://%s:%d%s
%s://%s%s
Invalid redirect URL! %s
HTTP request failed! %s
Unable to create filter (%s)
php://
/maxmemory:
Max memory must be >= 0
filter/
/resource=
No URL resource specified
write=
Invalid php:// URL specified
Output
URL file-access is disabled in the server configuration
<h1>PHP Credits</h1>
PHP Credits
PHP Group
Language Design &amp; Concept
Language Design & Concept
PHP 5 Authors
Contribution
Andi Gutmans, Zeev Suraski
Extension Module API
UNIX Build and Modularization
Win32 Port
Wez Furlong, Sara Golemon
Streams Abstraction Layer
PHP Data Objects Layer
SAPI Modules
Sascha Schumann
AOLserver
Apache 1.3 (apache_hooks)
Apache 1.3
Apache 2.0 Filter
Apache 2.0 Handler
David Hedbor
Caudium / Roxen
CGI / FastCGI
Continuity
Edin Kadribasic
Thies C. Arntzen
phttpd
Holger Zimmermann
pi3web
Harald Radi
Sendmail Milter
thttpd
Alex Waugh
WebJames
Module Authors
Module
Assert
Andi Gutmans
BC Math
Sterling Hughes
Calendar
Wez Furlong
COM and .Net
Hartmut Holzgraefe
Derick Rethans
Date/Time Support
Jim Winstead
Wez Furlong, Frank M. Kromann
DB-LIB (MS SQL, Sybase)
Uwe Steinmann
Ard Biesheuvel
Stefan Esser, Andrew Skalski
GD imaging
Alex Plotnick
GetText
Stanislav Malyshev
GNU GMP support
Input Filter
InterBase
Omar Kilani
LIBXML
mcrypt
mime_magic
Dave Hayden, Frank M. Kromann
MS SQL
Tsukada Takuya, Rui Hirokawa
Multibyte String Functions
mySQL driver for PDO
MySQLi
ncurses
ODBC driver for PDO
OpenSSL
Oracle (OCI) driver for PDO
Jason Greene
Andrei Zmievski
Perl Compatible Regexps
PHP Data Objects
PHP hash
Kristian Koehntopp
PostgreSQL driver for PDO
PostgreSQL
Vlad Krupin
Pspell
Readline
Kristian K
hntopp
Recode
Sessions
Shared Memory Operations
Sockets
Marcus Boerger
SQLite 3.x driver for PDO
SQLite
Sybase-CT
Sybase-DB
System V Message based IPC
Tom May
System V Semaphores
Christian Cartus
System V Shared Memory
tokenizer
Rob Richards
XMLReader
Dan Libby
xmlrpc
XMLWriter
Pierre-Alain Joye
PHP Documentation
Philip Olson
User Note Maintainers
Other Contributors
PHP Quality Assurance Team
PHP Website Team
</div></body></html>
Thies C. Arntzen, Stig Bakken, Shane Caraveo, Andi Gutmans, Rasmus Lerdorf, Sam Ruby, Sascha Schumann, Zeev Suraski, Jim Winstead, Andrei Zmievski
Andi Gutmans, Rasmus Lerdorf, Zeev Suraski
Zend Scripting Language Engine
Andi Gutmans, Zeev Suraski, Andrei Zmievski
Stig Bakken, Sascha Schumann, Jani Taskinen
Shane Caraveo, Zeev Suraski, Wez Furlong
Andi Gutmans, Shane Caraveo, Zeev Suraski
Server API (SAPI) Abstraction Layer
Wez Furlong, Marcus Boerger, Sterling Hughes, George Schlossnagle, Ilia Alshanetsky
Rasmus Lerdorf, Zeev Suraski, Stig Bakken, David Sklar, George Schlossnagle, Lukas Schroeder
Rasmus Lerdorf, Zeev Suraski, Stig Bakken, David Sklar
Sascha Schumann, Aaron Bannert
Ian Holsman, Justin Erenkrantz (based on Apache 2.0 Filter code)
Rasmus Lerdorf, Stig Bakken, Shane Caraveo, Dmitry Stogov
Edin Kadribasic, Marcus Boerger, Johannes Schlueter
Alex Leigh (based on nsapi code)
Jayakumar Muthukumarasamy, Uwe Schindler
Shane Caraveo, Colin Viebrock, Hartmut Holzgraefe, Wez Furlong
Sascha Schumann, Marcus Boerger
Christian Stocker, Rob Richards, Marcus Boerger
Rasmus Lerdorf, Marcus Boerger
Firebird/InterBase driver for PDO
Rasmus Lerdorf, Stig Bakken, Jim Winstead, Jouni Ahto, Ilia Alshanetsky, Pierre-Alain Joye, Marcus Boerger
Rui Hirokawa, Stig Bakken, Moriyoshi Koizumi 
Rex Logan, Mark Musone, Brian Wang, Kaj-Michael Lang, Antoni Pamies Olive, Rasmus Lerdorf, Andrew Skalski, Chuck Hagenbuch, Daniel R Kalowsky
Rasmus Lerdorf, Derick Rethans, Pierre-Alain Joye, Ilia Alshanetsky
Jouni Ahto, Andrew Avdeev, Ard Biesheuvel
Amitay Isaacs, Eric Warnke, Rasmus Lerdorf, Gerrit Thomson, Stig Venaas
Christian Stocker, Rob Richards, Marcus Boerger, Wez Furlong, Shane Caraveo
Sascha Schumann, Derick Rethans
George Schlossnagle, Wez Furlong, Ilia Alshanetsky
Zak Greant, Georg Richter, Andrey Hristov, Ulf Wendel
Zeev Suraski, Zak Greant, Georg Richter
Ilia Alshanetsky, Wez Furlong, Hartmut Holzgraefe, Georg Richter
Stig Bakken, Thies C. Arntzen, Andy Sautins, David Benson, Maxim Maletsky, Harald Radi, Antony Dovgal, Andi Gutmans, Wez Furlong
Stig Bakken, Andreas Karajannis, Frank M. Kromann, Daniel R. Kalowsky
Stig Venaas, Wez Furlong, Sascha Kettler
Sara Golemon, Rasmus Lerdorf, Stefan Esser, Michael Wallner
Edin Kadribasic, Ilia Alshanetsky
Jouni Ahto, Zeev Suraski, Yasuo Ohgaki, Chris Kings-Lynne
Marcus Boerger, Timm Friebe, George Schlossnagle, Andrei Zmievski, Johannes Schlueter
Sascha Schumann, Andrei Zmievski
Slava Poliakov, Ilia Alshanetsky
Sterling Hughes, Marcus Boerger, Rob Richards
Rasmus Lerdorf, Harrie Hazewinkel, Mike Jackson, Steven Lawrance, Johann Hanne
Brad Lafountain, Shane Caraveo, Dmitry Stogov
Chris Vandomelen, Sterling Hughes, Daniel Beulshausen, Jason Greene
Wez Furlong, Tal Peer, Marcus Boerger, Ilia Alshanetsky
Zeev Suraski, Tom May, Timm Friebe
John Coggeshall, Ilia Alshanetsky
Andrei Zmievski, Johannes Schlueter
Stig Bakken, Thies C. Arntzen, Sterling Hughes
Rob Richards, Pierre-Alain Joye
Christian Stocker, Rob Richards
Rasmus Lerdorf, Stefan Roehrich, Zeev Suraski, Jade Nicoletti
Mehdi Achour, Friedhelm Betz, Antony Dovgal, Nuno Lopes, Hannes Magnusson, Georg Richter, Damien Seguy, Jakub Vrana
Friedhelm Betz, Etienne Kneuss, Nuno Lopes, Hannes Magnusson, Felipe Pena, Maciek Sokolewicz, Daniel P. Brown
Previously active authors, editors and other contributors are listed in the manual.
Ilia Alshanetsky, Joerg Behrens, Antony Dovgal, Stefan Esser, Moriyoshi Koizumi, Magnus Maatta, Sebastian Nohn, Derick Rethans, Melvyn Sopacua, Jani Taskinen, Pierre-Alain Joye, Dmitry Stogov, Felipe Pena
Rasmus Lerdorf, Hannes Magnusson, Philip Olson
body {background-color: #ffffff; color: #000000;}
body, td, th, h1, h2 {font-family: sans-serif;}
pre {margin: 0px; font-family: monospace;}
a:link {color: #000099; text-decoration: none; background-color: #ffffff;}
a:hover {text-decoration: underline;}
table {border-collapse: collapse;}
.center {text-align: center;}
.center table { margin-left: auto; margin-right: auto; text-align: left;}
.center th { text-align: center !important; }
td, th { border: 1px solid #000000; font-size: 75%; vertical-align: baseline;}
.e {background-color: #ccccff; font-weight: bold; color: #000000;}
.h {background-color: #9999cc; font-weight: bold; color: #000000;}
.v {background-color: #cccccc; color: #000000;}
.vr {background-color: #cccccc; text-align: right; color: #000000;}
img {float: right; border: 0px;}
hr {width: 600px; background-color: #cccccc; border: 0px; height: 1px; color: #000000;}
h1 {font-size: 150%;}
h2 {font-size: 125%;}
.p {text-align: left;}
Unexpected end of serialized data
0123456789_abcdefghijklmnopqrstuvwxyzABCDEFGHIJKLMNOPQRSTUVWXYZ
Function %s() hasn't defined the class it was called for
Insufficient data for unserializing - %ld required, %ld present
defined (%s) but not found
Class %s has no unserializer
__wakeup
2147483648
Pathname is invalid
Project identifier is invalid
ftok() failed - %s
Filter name cannot be empty
Class name cannot be empty
onclose
userfilter.bucket brigade
datalen
Object has no bucket property
userfilter.bucket
userfilter.filter
PSFS_PASS_ON
PSFS_FEED_ME
PSFS_ERR_FATAL
PSFS_FLAG_NORMAL
PSFS_FLAG_FLUSH_INC
PSFS_FLAG_FLUSH_CLOSE
php_user_filter
oncreate
user-filter
onCreate
onClose
consumed
closing
failed to call filter function
Unprocessed filter buckets remaining on input brigade
cannot use a user-space filter with a persistent stream
Err, filter "%s" is not in the user-filter map, but somehow the user-filter-factory was invoked for it!?
user-filter "%s" requires class "%s", but that class is not defined
?The given parameter is not a valid uuencoded string
Failed allocating %zd bytes
base64-encode
base64-decode
quoted-printable-encode
quoted-printable-decode
force-encode-first
string.rot13
string.toupper
string.tolower
string.strip_tags
convert.*
ABCDEFGHIJKLMNOPQRSTUVWXYZabcdefghijklmnopqrstuvwxyz0123456789+/ABCDEFGHIJKLMNOPQRSTUVWXYZabcdefghijklmnopqrstuvwxyz0123456789+/ABCDEFGHIJKLMNOPQRSTUVWXYZabcdefghijklmnopqrstuvwxyz0123456789+/ABCDEFGHIJKLMNOPQRSTUVWXYZabcdefghijklmnopqrstuvwxyz0123456789+/@
0123456789ABCDEF
stream filter (%s): invalid byte sequence
stream filter (%s): insufficient buffer
stream filter (%s): unexpected end of stream
stream filter (%s): unknown error
stream filter (%s): unexpected octet values
stream filter (%s): invalid filter parameter
running
exitcode
saz|s!a!a!
unable to create pipe %s
/bin/sh
fork failed - %s
descriptor spec must be an integer indexed array
unable to dup File-Handle for descriptor %ld - %s
Descriptor item must be either an array or a File-Handle
Missing handle qualifier in array
Missing mode parameter for 'pipe'
Missing file name parameter for 'file'
Missing mode parameter for 'file'
pty pseudo terminal not supported on this system
%s is not a valid descriptor spec/mode
notification
failed to call user notifier
a!a!a!Z!|l
No stream arrays were passed
wrapper_data
wrapper_type
stream_type
unread_bytes
seekable
timed_out
blocked
accept failed: %s
s|zzlr
unable to connect to %s (%s)
s|zzd!lr
stream_socket_client__%s
When enabling encryption you must specify the crypto type
The maximum allowed length must be greater than or equal to zero
Invalid resource given, not a stream filter
Unable to flush filter, not removing
Could not invalidate filter, not removing
options should have the form ["wrappername"]["optionname"] = $value
Invalid stream/context parameter
called with wrong number or type of parameters; please RTM
The seconds parameter must be greater than 0
The microseconds parameter must be greater than 0
unable to select [%d]: %s (max_fd=%d)
Failed to parse `%s' into a valid network address
failed to create sockets: [%d]: %s
arg_separator.output
Error traversing form data array
Parameter 1 expected to be Array or Object.  Incorrect value given
Tokenizer Support
token_get_all
token_name
T_DOUBLE_COLON
UNKNOWN
T_REQUIRE_ONCE
T_REQUIRE
T_INCLUDE_ONCE
T_INCLUDE
T_LOGICAL_OR
T_LOGICAL_XOR
T_LOGICAL_AND
T_PRINT
T_SR_EQUAL
T_SL_EQUAL
T_XOR_EQUAL
T_OR_EQUAL
T_AND_EQUAL
T_MOD_EQUAL
T_CONCAT_EQUAL
T_DIV_EQUAL
T_MUL_EQUAL
T_MINUS_EQUAL
T_PLUS_EQUAL
T_BOOLEAN_OR
T_BOOLEAN_AND
T_IS_NOT_IDENTICAL
T_IS_IDENTICAL
T_IS_NOT_EQUAL
T_IS_EQUAL
T_IS_GREATER_OR_EQUAL
T_IS_SMALLER_OR_EQUAL
T_INSTANCEOF
T_UNSET_CAST
T_BOOL_CAST
T_OBJECT_CAST
T_ARRAY_CAST
T_STRING_CAST
T_DOUBLE_CAST
T_INT_CAST
T_CLONE
T_EXIT
T_ELSEIF
T_ELSE
T_ENDIF
T_LNUMBER
T_DNUMBER
T_STRING_VARNAME
T_VARIABLE
T_NUM_STRING
T_INLINE_HTML
T_CHARACTER
T_BAD_CHARACTER
T_ENCAPSED_AND_WHITESPACE
T_CONSTANT_ENCAPSED_STRING
T_ECHO
T_WHILE
T_ENDWHILE
T_ENDFOR
T_FOREACH
T_ENDFOREACH
T_DECLARE
T_ENDDECLARE
T_SWITCH
T_ENDSWITCH
T_CASE
T_DEFAULT
T_BREAK
T_CONTINUE
T_FUNCTION
T_CONST
T_RETURN
T_CATCH
T_THROW
T_GLOBAL
T_PUBLIC
T_PROTECTED
T_PRIVATE
T_FINAL
T_STATIC
T_UNSET
T_ISSET
T_EMPTY
T_HALT_COMPILER
T_CLASS
T_INTERFACE
T_EXTENDS
T_IMPLEMENTS
T_OBJECT_OPERATOR
T_DOUBLE_ARROW
T_LIST
T_ARRAY
T_CLASS_C
T_METHOD_C
T_FUNC_C
T_LINE
T_FILE
T_COMMENT
T_DOC_COMMENT
T_OPEN_TAG
T_OPEN_TAG_WITH_ECHO
T_CLOSE_TAG
T_WHITESPACE
T_START_HEREDOC
T_END_HEREDOC
T_DOLLAR_OPEN_CURLY_BRACES
T_CURLY_OPEN
T_PAAMAYIM_NEKUDOTAYIM
XML Parser
US-ASCII
Unable to call handler %s()
Unable to call handler
XML Support
XML Namespace Support
libxml2 Version
XML_ERROR_NONE
XML_ERROR_NO_MEMORY
XML_ERROR_SYNTAX
XML_ERROR_NO_ELEMENTS
XML_ERROR_INVALID_TOKEN
XML_ERROR_UNCLOSED_TOKEN
XML_ERROR_PARTIAL_CHAR
XML_ERROR_TAG_MISMATCH
XML_ERROR_DUPLICATE_ATTRIBUTE
XML_ERROR_PARAM_ENTITY_REF
XML_ERROR_UNDEFINED_ENTITY
XML_ERROR_ASYNC_ENTITY
XML_ERROR_BAD_CHAR_REF
XML_ERROR_BINARY_ENTITY_REF
XML_ERROR_MISPLACED_XML_PI
XML_ERROR_UNKNOWN_ENCODING
XML_ERROR_INCORRECT_ENCODING
XML_OPTION_CASE_FOLDING
XML_OPTION_TARGET_ENCODING
XML_OPTION_SKIP_TAGSTART
XML_OPTION_SKIP_WHITE
XML_SAX_IMPL
Unknown option
Argument 2 has wrong type
complete
xml_parser_create
xml_parser_create_ns
xml_set_object
xml_set_element_handler
xml_set_default_handler
xml_set_notation_decl_handler
xml_parse
xml_parse_into_struct
xml_get_error_code
xml_error_string
xml_get_current_line_number
xml_get_current_column_number
xml_get_current_byte_index
xml_parser_free
xml_parser_set_option
xml_parser_get_option
utf8_encode
utf8_decode
Parser cannot be freed while it is parsing.
unsupported source encoding "%s"
Unable to call handler %s::%s()
XML_ERROR_JUNK_AFTER_DOC_ELEMENT
XML_ERROR_RECURSIVE_ENTITY_REF
XML_ERROR_ATTRIBUTE_EXTERNAL_ENTITY_REF
XML_ERROR_UNCLOSED_CDATA_SECTION
XML_ERROR_EXTERNAL_ENTITY_HANDLING
Maximum depth exceeded - Results truncated
Unsupported target encoding "%s"
xml_set_character_data_handler
xml_set_processing_instruction_handler
xml_set_unparsed_entity_decl_handler
xml_set_external_entity_ref_handler
xml_set_start_namespace_decl_handler
xml_set_end_namespace_decl_handler
</%s:%s>
 %s="%s"
 xmlns:%s="%s"
 xmlns="%s"
 %s:%s="
<?%s %s?>
No error
Invalid document start
Empty document
Invalid document end
Invalid character reference
Invalid character
XML_ERR_CHARREF_AT_EOF
XML_ERR_CHARREF_IN_PROLOG
XML_ERR_CHARREF_IN_EPILOG
XML_ERR_CHARREF_IN_DTD
XML_ERR_ENTITYREF_AT_EOF
XML_ERR_ENTITYREF_IN_PROLOG
XML_ERR_ENTITYREF_IN_EPILOG
XML_ERR_ENTITYREF_IN_DTD
PEReference in prolog
PEReference in epilog
XML_ERR_ENTITYREF_NO_NAME
EntityRef: expecting ';'
PEReference: no name
PEReference: expecting ';'
Undeclared entity error
Undeclared entity warning
Unparsed Entity
XML_ERR_ENTITY_IS_EXTERNAL
XML_ERR_ENTITY_IS_PARAMETER
Unknown encoding
Unsupported encoding
Namespace declaration error
EntityValue: " or ' expected
< in attribute
Attribute not started
Attribute not finished
Attribute without value
Attribute redefined
SystemLiteral " or ' expected
Comment not finished
NOTATION: Name expected here
XML_ERR_MIXED_NOT_FINISHED
ELEMENT in DTD not started
ELEMENT in DTD not finished
XML declaration not started
XML declaration not finished
XML_ERR_CONDSEC_NOT_STARTED
DOCTYPE not finished
CDATA not finished
Reserved XML Name
Space required
XML_ERR_SEPARATOR_REQUIRED
XML_ERR_NAME_REQUIRED
< required
> required
</ required
= required
Mismatched tag
Tag not finished
Invalid XML encoding name
Invalid encoding
Entity value required
chunk is not well balanced
XML_ERR_ENTITY_CHAR_ERROR
XML_ERR_ENTITY_BOUNDARY
Invalid URI
Fragment not allowed
XML_WAR_CATALOG_PI
XML_ERR_NO_DTD
XML_WAR_UNKNOWN_VERSION
XML_WAR_LANG_VALUE
XML_WAR_NS_URI
XML_WAR_NS_URI_RELATIVE
Not well-formed (invalid token)
Invalid hexadecimal character reference
Invalid decimal character reference
PEReference at end of document
PEReference: forbidden within markup decl in internal subset
String not started expecting ' or "
String not closed expecting " or '
Processing Instruction not started
Processing Instruction not finished
'>' required to close NOTATION declaration
'(' required to start ATTLIST enumeration
MixedContentDecl : '|' or ')*' expected
XML conditional section not closed
Content error in the external subset
Sequence ']]>' not allowed in content
NmToken expected in ATTLIST enumeration
MixedContentDecl : '#PCDATA' expected
SYSTEM or PUBLIC, the URI is missing
PUBLIC, the Public Identifier is missing
standalone accepts only 'yes' or 'no'
Comment must not contain '--' (double-hyphen)
external parsed entities cannot be standalone
XML conditional section '[' expected
extra content at the end of well balanced chunk
PEReferences forbidden in internal subset
Detected an entity reference loop
conditional section INCLUDE or IGNORE keyword expected
Version in XML Declaration missing
Missing encoding in text declaration
Basic 
Digest 
STDERR
STDOUT
X-Powered-By: PHP/5.2.17
index pointer
PHP_VERSION
PHP_MAJOR_VERSION
PHP_MINOR_VERSION
PHP_RELEASE_VERSION
PHP_EXTRA_VERSION
PHP_VERSION_ID
PHP_ZTS
PHP_DEBUG
PHP_OS
PHP_SAPI
DEFAULT_INCLUDE_PATH
/usr/share/pear
PEAR_INSTALL_DIR
/usr/lib/php/modules
PEAR_EXTENSION_DIR
PHP_EXTENSION_DIR
PHP_PREFIX
/usr/bin
PHP_BINDIR
/usr/lib
PHP_LIBDIR
/usr/share
PHP_DATADIR
PHP_SYSCONFDIR
PHP_LOCALSTATEDIR
PHP_CONFIG_FILE_PATH
/etc/php.d
PHP_CONFIG_FILE_SCAN_DIR
PHP_SHLIB_SUFFIX
PHP_EOL
PHP_INT_MAX
PHP_INT_SIZE
Unable to start PHP ticks
disable_functions
disable_classes
PHP Startup
PHP Shutdown
include_once
function.%s
%s [%s%s%s]: %s
%s: %s
php_errormsg
require_once
%s%s%s(%s)
function.include
function.require
[%s]  Script:  '%s'
[null]  Script:  '%s'
d-M-Y H:i:s
[%s] %s%s
Strict Standards
Fatal error
Catchable fatal error
Parse error
Notice
PHP %s:  %s in %s on line %d
error_prepend_string
error_append_string
%s: %s in %s on line %d
%s: %s in %s on line %d
highlight.bg
#FFFFFF
#FF8000
#0000BB
#000000
#007700
#DD0000
asp_tags
display_errors
display_startup_errors
enable_dl
docref_root
docref_ext
html_errors
xmlrpc_errors
xmlrpc_error_number
max_input_time
log_errors
log_errors_max_len
ignore_repeated_errors
ignore_repeated_source
report_memleaks
report_zend_debug
magic_quotes_sybase
output_buffering
register_argc_argv
register_globals
register_long_arrays
auto_globals_jit
safe_mode_include_dir
safe_mode_gid
short_open_tag
sql.safe_mode
track_errors
y2k_compliance
unserialize_callback_func
serialize_precision
arg_separator.input
auto_append_file
auto_prepend_file
doc_root
default_charset
default_mimetype
open_basedir
safe_mode_exec_dir
upload_max_filesize
post_max_size
upload_tmp_dir
max_input_nesting_level
user_dir
variables_order
localhost
smtp_port
mail.add_x_header
sendmail_from
/usr/sbin/sendmail -t -i 
max_file_uploads
allow_url_fopen
allow_url_include
max_input_vars
always_populate_raw_post_data
realpath_cache_size
realpath_cache_ttl
/home/lxcenter/rpmbuild/BUILD/php-5.2.17/main/main.c
PHP:  Unable to initialize stream url wrappers.
PHP:  Unable to initialize info phpinfo logos.
.:/usr/share/pear:/usr/share/php
Unable to start builtin modules
%s [<a href='%s%s%s'>%s</a>]: %s
Failed opening '%s' for inclusion (include_path='%s')
Failed opening required '%s' (include_path='%s')
Failed opening '%s' for highlighting
Cannot set time limit in safe mode
<?xml version="1.0"?><methodResponse><fault><value><struct><member><name>faultCode</name><value><int>%ld</int></value></member><member><name>faultString</name><value><string>%s:%s in %s on line %d</string></value></member></struct></value></fault></methodResponse>
%s<br />
<b>%s</b>:  %s in <b>%s</b> on line <b>%d</b><br />
HTTP/1.0 500 Internal Server Error
allow_call_time_pass_reference
(null)
Illegal length modifier specified '%c' in s[np]printf call
Unable to access %s
SAFE MODE Restriction in effect.  The script whose uid/gid is %ld/%ld is not allowed to access %s owned by uid/gid %ld/%ld
SAFE MODE Restriction in effect.  The script whose uid is %ld is not allowed to access %s owned by uid %ld
%s%c%s%c%s
open_basedir restriction in effect. File(%s) is not within the allowed path(s): (%s)
%s/%s path was truncated to %d
Master Value
Local Value
Directive
no value
php-%s.ini
php.ini
cfg_file_path
PHP_INI_SCAN_DIR
zend_extension
;charset=
Content-Type
image/
Content-type: 
WWW-Authenticate
realm="\1-%ld"
/realm="(.*?)"/i
realm=\1-%ld\2
/realm=([^\s]+)(.*)/i
 realm="%ld"
WWW-Authenticate: %s
HTTP/1.0 %d X
Unsupported content type:  '%s'
POST Content-Length of %ld bytes exceeds the limit of %ld bytes
Actual POST length does not match Content-Length, and exceeds %ld bytes
Cannot modify header information - headers already sent by (output started at %s:%d)
Cannot modify header information - headers already sent
Header may not contain more than a single header, new line detected.
boundary
MAX_FILE_SIZE
%s_name[%s]
%s_name
%s[name][%s]
%s[name]
%s_type[%s]
%s_type
%s[type][%s]
%s[type]
%s[tmp_name][%s]
%s[tmp_name]
%s[error][%s]
%s_size[%s]
%s[error]
%s_size
%s[size][%s]
%s[size]
Content-Disposition
UPLOAD_ERR_OK
UPLOAD_ERR_INI_SIZE
UPLOAD_ERR_FORM_SIZE
UPLOAD_ERR_PARTIAL
UPLOAD_ERR_NO_FILE
UPLOAD_ERR_NO_TMP_DIR
UPLOAD_ERR_CANT_WRITE
UPLOAD_ERR_EXTENSION
Missing boundary in multipart/form-data POST data
Invalid boundary in multipart/form-data POST data
Maximum number of allowable file uploads has been exceeded
File Upload Mime headers garbled
File upload error - unable to create a temporary file
multipart/form-data
PHP_AUTH_DIGEST
REQUEST_TIME
PHPB8B5F2A0-3C92-11d3-A3A9-4C7B08C10000
Input variable nesting level exceeded %ld. To increase the limit change max_input_nesting_level in php.ini.
Input variables exceeded %ld. To increase the limit change max_input_vars in php.ini.
You MUST recompile PHP with a larger value of FD_SETSIZE.
It is set to %d, but you have descriptors numbered at least as high as %d.
 --enable-fd-setsize=%d is recommended, but you may want to set it
to equal the maximum number of open files supported by your system,
in order to avoid seeing this error again at a later date.
php_network_getaddresses: getaddrinfo failed: %s
php_network_getaddresses: getaddrinfo failed (null result pointer) errno=%d
php_network_getaddresses: getaddrinfo failed (null result pointer)
failed to bind to '%s:%d', system said: %s
Invalid IP Address: %s
Failed to resolve `%s': %s
%s%s%sXXXXXX
TMPDIR
GIF89ax
97G(%*
.+/SQh
&q|.ll
 J]lQi
^tq(R#
f9K2pa
$e4zYF
GIF89aq
7Pi-?Q159
sssUUU<<<777&&&
C68:85
`C_=(:
;block_size
buffer_size
default output handler
PHP_OUTPUT_HANDLER_START
PHP_OUTPUT_HANDLER_CONT
PHP_OUTPUT_HANDLER_END
failed to delete buffer %s.
/home/lxcenter/rpmbuild/BUILD/php-5.2.17/main/output.c
output handler '%s' conflicts with '%s'
failed to delete buffer. No buffer to delete.
failed to delete and flush buffer. No buffer to delete or flush.
failed to flush buffer. No buffer to flush.
No method name given: use ob_start(array($object,'method')) to specify instance $object and the name of a method of class %s to use as output handler
Cannot use output buffering in output buffering display handlers
file://localhost/
Plainfiles wrapper disabled
persistent stream
stream filter
operation failed
Filename cannot be empty
could not make seekable - %s
failed to open stream
not implemented
failed to open dir
Use of "zlib:" wrapper is deprecated; please use "compress.zlib://" instead.
Unable to find the wrapper "%s" - did you forget to enable it when you configured PHP?
remote host file access not supported, %s
no suitable wrapper could be found
This function may only be used against URLs.
wrapper does not support stream open
wrapper does not support persistent streams
stream does not support seeking
fopencookie failed
STDIO FILE*
File Descriptor
Socket Descriptor
select()able descriptor
cannot cast a filtered stream on this system
cannot represent a stream of type %s as a %s
%ld bytes of buffered data lost during stream conversion!
rfc2397: no comma in URL
rfc2397: illegal media type
mediatype
;base64
rfc2397: illegal parameter
rfc2397: illegal URL
rfc2397: unable to decode
RFC2397
unable to locate filter "%s"
unable to create or locate filter "%s"
Filter failed to process pre-buffered data
cannot seek on a pipe
streams_stdio_%d_%s
unable to allocate stream
plainfile
`%s' is not a valid mode for fopen
dir_rewinddir
dir_closedir
stream_close
dir_readdir
stream_flush
stream_eof
stream_lock
stream_seek
stream_tell
stream_write
class '%s' is undefined
%s::rmdir is not implemented!
%s::mkdir is not implemented!
infinite recursion prevented
dir_opendir
"%s::dir_opendir" call failed
Could not execute %s::%s()
stream_open
"%s::stream_open" call failed
stream factory
STREAM_USE_PATH
STREAM_IGNORE_URL
STREAM_ENFORCE_SAFE_MODE
STREAM_REPORT_ERRORS
STREAM_MUST_SEEK
STREAM_URL_STAT_LINK
STREAM_URL_STAT_QUIET
STREAM_MKDIR_RECURSIVE
STREAM_IS_URL
stream_read
url_stat
stream_stat
user-space
user-space-dir
%s::dir_readdir is not implemented!
%s::stream_eof is not implemented! Assuming EOF
%s::stream_lock is not implemented!
%s::stream_tell is not implemented!
%s::stream_write is not implemented!
%s::stream_write wrote %ld bytes more data than requested (%ld written, %ld max)
Unable to unregister protocol %s://
%s:// was never changed, nothing to restore
%s:// never existed, nothing to restore
Unable to restore original %s:// wrapper
Protocol %s:// is already defined.
Invalid protocol scheme specified. Unable to register wrapper class %s to %s://
%s::rename is not implemented!
%s::unlink is not implemented!
%s::stream_read - read %ld bytes more data than requested (%ld read, %ld max) - excess data will be lost
%s::stream_read is not implemented!
%s::url_stat is not implemented!
%s::stream_stat is not implemented!
cannot write OOB data, or data to a targeted address on a filtered stream
this stream does not support SSL/crypto
Unable to find the socket transport "%s" - did you forget to enable it when you configured PHP?
streams.crypto
Could not find a factory !?
Unspecified error
connect() failed: %s
bind() failed: %s
listen() failed: %s
send of %ld bytes failed with errno=%ld %s
Failed to parse IPv6 address "%s"
local_addr context option is not a string.
Failed to create unix%s socket %s
Failed to create unix socket
Failed to parse address "%s"
bindto
datagram
generic_socket
tcp_socket
udp_socket
unix_socket
udg_socket
__HALT_COMPILER() can only be used from the outermost scope
use: Not yet supported. Please use include_once() or require_once()
Assigning the return value of new by reference is deprecated
function_declaration_statement
unticked_function_declaration_statement
unticked_class_declaration_statement
non_empty_function_call_parameter_list
dynamic_class_name_variable_properties
dynamic_class_name_variable_property
non_empty_static_array_pair_list
base_variable_with_function_calls
syntax error
memory exhausted
$undefined
$accept
top_statement_list
top_statement
inner_statement_list
inner_statement
unticked_statement
non_empty_additional_catches
additional_catch
unset_variables
unset_variable
use_filename
class_declaration_statement
is_reference
class_entry_type
extends_from
interface_entry
interface_extends_list
implements_list
interface_list
foreach_optional_arg
foreach_variable
for_statement
foreach_statement
declare_statement
declare_list
switch_case_list
case_separator
while_statement
new_elseif_list
new_else_single
non_empty_parameter_list
optional_class_type
function_call_parameter_list
global_var_list
global_var
static_var_list
class_statement_list
class_statement
method_body
variable_modifiers
method_modifiers
non_empty_member_modifiers
member_modifier
class_variable_declaration
class_constant_declaration
echo_expr_list
non_empty_for_expr
expr_without_variable
function_call
fully_qualified_class_name
dynamic_class_name_reference
exit_expr
ctor_arguments
common_scalar
static_scalar
static_class_constant
static_array_pair_list
possible_comma
r_variable
rw_variable
variable_properties
variable_property
method_or_not
variable_without_objects
static_member
base_variable
reference_variable
compound_variable
dim_offset
object_property
object_dim_list
variable_name
simple_indirect_reference
assignment_list
assignment_list_element
non_empty_array_pair_list
encaps_list
encaps_var
encaps_var_offset
internal_functions_in_yacc
isset_variables
 !"#&'()1456789:;<>?@ABCDEFGHIJKLMNOPQRSTUVWXYZ[\]^_`abcdefghijklmnopqrstuvwxyz{|}~
 or %s
, expecting %s
bad buffer in yy_scan_bytes()
input in flex scanner failed
start-condition stack underflow
out of dynamic memory in yy_scan_buffer()
out of dynamic memory in yy_scan_bytes()
out of dynamic memory in yy_create_buffer()
out of memory expanding start-condition stack
/home/lxcenter/rpmbuild/BUILD/php-5.2.17/Zend/zend_language_scanner.l
Unterminated comment starting line %d
Unexpected character in input:  '%c' (ASCII=%d) state=%d
fatal flex scanner internal error--end of buffer missed
fatal error - scanner input buffer overflow
fatal flex scanner internal error--no action found
"~"w"|"v"
"w"z"j"
"z"u"v"e"i"_
e"n"^"D
e"\"j"m"h"i"i"^"]"T"b"a"Q"
P"W"M"L"L"K"O"
I"O"V"U"I"R"R"
M"E"G"J"*
K"?"<"=":"3"4","9"
;"/"<","6"="("
3"""5"*"2" "."
'"("2"
 & 2 > J V b n z 
!"!.!:!F!R!^!j!v!
2147483648
Error parsing %s on line %d
PHP:  %s
Invalid configuration directive
Possible integer overflow in memory allocation (%zu * %zu + %zu)
/home/lxcenter/rpmbuild/BUILD/php-5.2.17/Zend/zend_alloc.c
Allowed memory size of %ld bytes exhausted (tried to allocate %lu bytes)
Out of memory (allocated %ld) (tried to allocate %lu bytes)
'block_size' must be a power of two
Cannot initialize zend_mm storage [%s]
Wrong or unsupported zend_mm storage type '%s'
ZEND_MM_SEG_SIZE must be a power of two
ZEND_MM_SEG_SIZE is too small
Allowed memory size of %ld bytes exhausted (tried to allocate %ld bytes)
Out of memory (allocated %ld) (tried to allocate %ld bytes)
/dev/zero
zend_mm_heap corrupted
Fatal error: 
ZEND_MM_MEM_TYPE
  supported types:
    '%s'
ZEND_MM_SEG_SIZE
ZEND_MM_COMPACT
USE_ZEND_ALLOC
malloc
mmap_anon
mmap_zero
Illegal member variable name
Corrupt member variable name
Cannot redeclare %s()
Cannot redeclare %s::$%s
Cannot redeclare class %s
%c%s%s%s
 or weaker
Cannot re-assign $this
Cannot redeclare %s::%s()
__destruct
__call
__unset
__isset
Cannot use [] for reading
Cannot use [] for unsetting
__COMPILER_HALT_OFFSET__
non static 
Invalid binding type
instanceof expects an object instance, constant given
Cannot use 'self' as interface name as it is reserved
Cannot use 'parent' as interface name as it is reserved
Internal compiler error.  Please report!
Cannot redeclare %s() (previously declared in %s:%d)
Clone method does not require arguments
Multiple access type modifiers are not allowed
Cannot use the final modifier on an abstract class member
Can't use method return value in write context
Can't use function return value in write context
%s function %s::%s() cannot be declared private
%s function %s::%s() cannot contain body
Non-abstract method %s::%s() must contain body
Interfaces may not include member variables
Properties cannot be declared abstract
Cannot declare property %s::$%s final, the final modifier is allowed only for methods and classes
Internal Zend error - Missing class information for %s
Class %s could not implement interface %s
Interface %s cannot implement itself
Cannot inherit previously-inherited or override constant %s from interface %s
Can't inherit abstract function %s::%s() (previously declared abstract in %s)
Cannot override final method %s::%s()
Cannot make non static method %s::%s() static in class %s
Cannot make static method %s::%s() non static in class %s
Cannot make non abstract method %s::%s() abstract in class %s
Access level to %s::%s() must be %s (as in class %s)%s
Declaration of %s::%s() must be compatible with that of %s::%s()
Declaration of %s::%s() should be compatible with that of %s::%s()
Default value for parameters with a class type hint can only be NULL
Default value for parameters with array type hint can only be an array or NULL
Access type for interface method %s::%s() must be omitted
Static function %s%s%s() should not be abstract
Redefining already defined constructor for class %s
Cannot call __clone() method on objects - use 'clone $obj' instead
Cannot redeclare %s%s::$%s as %s%s::$%s
Access level to %s::$%s must be %s (as in class %s)%s
Cannot change initial value of property static protected %s::$%s in class %s
%s() must take exactly 1 argument
Call-time pass-by-reference has been deprecated; If you would like to pass it by reference, modify the declaration of %s().  If you would like to enable call-time pass-by-reference, you can set allow_call_time_pass_reference to true in your INI file
Call-time pass-by-reference has been deprecated
Only variables can be passed by reference
Arrays are not allowed in class constants
Cannot redefine class constant %s::%s
Class %s cannot implement previously implemented interface %s
Key element cannot be a reference
Cannot create references to elements of a temporary array expression
Class declarations may not be nested
Cannot use '%s' as class name as it is reserved
Cannot use 'self' as class name as it is reserved
Cannot use 'parent' as class name as it is reserved
Cannot override final %s::%s() with %s::%s()
Constructor %s::%s() cannot be static
Destructor %s::%s() cannot be static
Clone method %s::%s() cannot be static
Interface %s may not inherit from class (%s)
Class %s may not inherit from final class (%s)
Class %s cannot extend from interface %s
Constant %s already defined
E_RECOVERABLE_ERROR
E_PARSE
E_NOTICE
E_CORE_ERROR
E_CORE_WARNING
E_COMPILE_ERROR
E_COMPILE_WARNING
E_USER_ERROR
E_USER_WARNING
E_USER_NOTICE
ZEND_THREAD_SAFE
Cannot access self:: when no class scope is active
Cannot access parent:: when no class scope is active
Cannot access parent:: when current class scope has no parent
[no active file]
Undefined class constant '%s'
Class '%s' not found
Interface '%s' not found
Class %s contains %d abstract method%s and must therefore be declared abstract or implement the remaining methods (%s%s%s%s%s%s%s%s%s%s%s%s)
Maximum execution time of %d second%s exceeded
Cannot declare self-referencing constant '%s'
Use of undefined constant %s - assumed '%s'
Corrupted fcall_info provided to zend_call_function()
Cannot use call_user_function on objects without a class entry
Non-callable array passed to zend_call_function()
Cannot call method %s() or method does not exist
Object does not support method calls
Cannot call method %s::%s() or method does not exist
Cannot call method %s() of class %s which is not a derived from %s
Cannot call abstract method %s::%s()
Function %s%s%s() is deprecated
Non-static method %s::%s() cannot be called statically
Function %s(%s) threw an exception of type '%s'
&nbsp;&nbsp;&nbsp;&nbsp;
<code>
<span style="color: %s">
</span>
<span style="color: %s">
</span>
</code>
Class %s:
End of class %s.
Ran out of opcode space!
You should probably consider writing this huge script into a file!
/home/lxcenter/rpmbuild/BUILD/php-5.2.17/Zend/zend_opcode.c
Unsupported operand types
String size overflow
Resource id #%ld
Array to string conversion
Division by zero
A non well formed numeric value encountered
Object of class %s could not be converted to %s
Object of class %s to string conversion
Object of class %s could not be converted to double
Cannot convert to real value (type=%d)
Object of class %s could not be converted to int
Cannot convert to ordinal value
2147483648
Internal zval's can't be arrays, objects or resources
%s(%d) : %s
    with %s v%s, %s, by %s
stdClass
stdclass
Array (
 *RECURSION*
Unknown Class
%s Object (
 Object
error_reporting
zend.ze1_compatibility_mode
%s(%d) : Bailed out without a bailout address!
Zend Engine v2.2.0, Copyright (c) 1998-2010 Zend Technologies
Object of class %s could not be converted to string
abstract class
Cannot instantiate %s %s
Unable to start %s module
Module '%s' already loaded
exactly
at least
at most
display_disabled_function
2147483648
add_assoc_function() is no longer supported
Class entry requested for an object without PHP class
Property %s of class %s cannot be read
Property %s of class %s cannot be updated
Implicit cloning object of class '%s' because of 'zend.ze1_compatibility_mode'
Trying to clone uncloneable object of class %s
Destructor %s::%s() cannot take arguments
Method %s::%s() cannot accept any arguments
Method %s::%s() must take exactly 1 argument
Method %s::%s() cannot take arguments by reference
Method %s::%s() must take exactly 2 arguments
%s() has been disabled for security reasons
request_startup() for %s module failed
Wrong parameter count for %s%s%s()
Cannot load module '%s' because required module '%s' is not loaded
Invalid access level for %s%s%s() - access must be exactly one of public, protected or private
Static function %s%s%s() cannot be abstract
Interface %s cannot contain non abstract method %s()
Method %s%s%s() cannot be a NULL function
Function registration failed - duplicate name - %s%s%s
Method %s::%s() cannot be static
Cannot load module '%s' because conflicting module '%s' is already loaded
%s:  Unable to register functions, unable to load
Non-static method %s::%s() cannot be called statically, assuming $this from compatible context %s
%s%s%s(): bad type specifier while parsing parameters
%s%s%s() expects %s %d parameter%s, %d given
%s(): could not obtain parameters for parsing
%s%s%s() expects parameter %d to be a class name derived from %s, '%s' given
%s%s%s() expects parameter %d to be a valid class name, '%s' given
%s%s%s() expects parameter %d to be %s, %s given
%s::%s() must be derived from %s::%s
Failed loading %s:  %s
_extension_version_info
_zend_extension_entry
does not
%s doesn't appear to be a valid Zend extension
%s requires Zend Engine API version %d.
The Zend Engine API version %d which is installed, is outdated.
%s requires Zend Engine API version %d.
The Zend Engine API version %d which is installed, is newer.
Contact %s at %s for a later version of %s.
Cannot load %s - it %s thread safe, whereas Zend %s
Cannot load %s - it %s debug information, whereas Zend %s
Nesting level too deep - recursive dependency?
Unknown persistent list entry type in module shutdown (%d)
Unknown list entry type in request shutdown (%d)
%s%s%s(): no %s resource supplied
%s%s%s(): supplied argument is not a valid %s resource
%s%s%s(): %d is not a valid %s resource
%s%s%s(): supplied resource is not a valid %s resource
#%-2d 
) called at [%s:%d]
runtime-created function
__lambda_func
%clambda_%d
Invalid error type specified
zend_version
func_num_args
func_get_arg
func_get_args
strcmp
strncmp
strcasecmp
strncasecmp
define
get_class
get_parent_class
method_exists
property_exists
class_exists
interface_exists
function_exists
get_included_files
get_required_files
is_subclass_of
get_class_vars
get_object_vars
get_class_methods
trigger_error
user_error
set_error_handler
restore_error_handler
set_exception_handler
restore_exception_handler
get_declared_classes
get_declared_interfaces
get_defined_functions
get_defined_vars
create_function
get_resource_type
get_loaded_extensions
extension_loaded
get_extension_funcs
get_defined_constants
debug_backtrace
debug_print_backtrace
func_num_args(): Can't be used as a function parameter
func_num_args():  Called from the global scope - no function context
Supplied argument is not a valid resource handle
get_class() called without object from outside a class
Cannot add internal functions to return value from get_defined_functions()
Cannot add user functions to return value from get_defined_functions()
function __lambda_func(%s){%s}
Unexpected inconsistency in create_function()
func_get_args(): Can't be used as a function parameter
func_get_args():  Called from the global scope - no function context
func_get_arg():  The argument number should be >= 0
func_get_arg(): Can't be used as a function parameter
func_get_arg():  Called from the global scope - no function context
func_get_arg():  Argument %ld not passed to function
Length must be greater than or equal to 0
%s() expects the argument (%s) to be a valid callback
First parameter must either be an object or the name of an existing class
Unknown class passed as parameter
is_a(): Deprecated. Please use the instanceof operator
Constants may only evaluate to scalar values
Class constants cannot be defined or redefined
Variable passed to each() is not an array or object
Unlimited
<font style="color: %s">%s</font>
__iterator_wrapper
Class %s cannot implement both %s and %s at the same time
Class %s must implement interface %s as part of either %s or %s
Couldn't find implementation for method %s%s%s
Couldn't execute method %s%s%s
%s::serialize() must return a string or NULL
Nothing returned from %s::key()
Illegal type returned from %s::key()
Objects returned by %s::getIterator() must be traversable or implement interface Iterator
IteratorAggregate
ArrayAccess
Serializable
Exception thrown without a stack frame
Need to supply an object when throwing an exception
Exceptions must be valid objects derived from the Exception base class
%s::__toString() must return a string
Uncaught %s in exception handling during call to %s::__tostring()
Exceptions must be derived from the Exception base class
Wrong parameters for ErrorException([string $exception [, long $code, [ long $severity, [ string $filename, [ long $lineno ]]]]])
Wrong parameters for Exception([string $exception [, long $code ]])
exception '%s' with message '%s' in %s:%ld
Stack trace:
exception '%s' in %s:%ld
Stack trace:
Uncaught %s
  thrown
Uncaught exception '%s'
severity
|sllsl
%s(%ld): 
#%d {main}
ErrorException
gettraceasstring
#0 {main}
getMessage
getCode
getFile
getLine
getTrace
getTraceAsString
getSeverity
lineno
@Balloc() allocation exceeds list boundary
Balloc() failed to allocate memory
uInfinity
 during shutdown ignored
Trying to clone an uncloneable object of class %s
Call to private %s::__destruct() from context '%s'%s
Call to protected %s::__destruct() from context '%s'%s
Ignoring exception from %s::__destruct() while an exception is already active (Uncaught %s in %s on line %ld)
Attempt to unset static property %s::$%s
Cannot access property started with '\0'
Accessing static property %s::$%s as non static
Cannot access %s property %s::$%s
Access to undeclared static property: %s::$%s
Call to private %s::%s() from context '%s'
Call to private %s::%s() from invalid context
Call to protected %s::%s() from context '%s'
Call to protected %s::%s() from invalid context
Method %s::__toString() must not throw an exception
Method %s::__toString() must return a string value
Cannot get arguments for __call
Undefined offset for object of type %s used as array
Cannot use object of type %s as array
Indirect modification of overloaded property %s::$%s has no effect
Call to undefined method %s::%s()
Call to %s method %s::%s() from context '%s'
Cannot access empty property
Undefined property: %s::$%s
Cannot read property of object - no read handler defined
Cannot write property of object - no write handler defined
/home/lxcenter/rpmbuild/BUILD/php-5.2.17/Zend/zend_objects_API.c
Invalid opcode %d/%d/%d.
should not
cannot
Can only throw objects
eval()'d code
Undefined variable: %s
Cannot use object as array
Method name must be a string
Can not call constructor
Illegal offset type in unset
Cannot unset string offsets
implement interface 
be an instance of 
Illegal string offset:  %d
Class name must be a valid object or a string
%s cannot implement %s - it is not an interface
Non-static method %s::%s() %s be called statically, assuming $this from incompatible context
Using $this when not in object context
__clone method called on non-object
Trying to clone an uncloneable object
Call to private %s::__clone() from context '%s'
Call to protected %s::__clone() from context '%s'
/home/lxcenter/rpmbuild/BUILD/php-5.2.17/Zend/zend_vm_execute.h
Only variable references should be returned by reference
Cannot pass parameter %d by reference
Object of type %s did not create an Iterator
Invalid argument supplied for foreach()
Cannot use string offset as an object
Cannot access undefined property for object with overloaded property access
This object doesn't support property references
Cannot create references to/from string offsets nor overloaded objects
Only variables should be passed by reference
Cannot use string offset as an array
Resource ID#%ld used as offset, casting to integer (%ld)
Cannot use a NULL value as an array
[] operator not supported for strings
Uninitialized string offset: %ld
Indirect modification of overloaded element of %s has no effect
Cannot unset offset in a non-array variable
Cannot use a scalar value as an array
Trying to get property of non-object
Cannot break/continue %d level%s
Call to a member function %s() on a non-object
Cannot call private %s::__construct()
Function name must be a string
Call to undefined function %s()
Non-static method %s::%s() %s be called statically
Argument %d passed to %s%s%s() must %s%s, %s%s given, called in %s on line %d and defined
Argument %d passed to %s%s%s() must %s%s, %s%s given
Cannot call overloaded function for non-object
Cannot increment/decrement overloaded objects nor string offsets
Creating default object from empty value
Attempt to increment/decrement property of non-object
Attempt to assign property of non-object
Illegal offset type in isset or empty
Cannot assign by reference to overloaded object
Only variables should be assigned by reference
Missing argument %ld for %s%s%s(), called in %s on line %d and defined
Missing argument %ld for %s%s%s()
foreach() can not iterate over objects without PHP class
Cannot return string offsets by reference
Cannot use assign-op operators with overloaded objects nor string offsets
Unknown error %d has occured
Error assigning signal
Error %d
pcntl support
WNOHANG
WUNTRACED
SIG_IGN
SIG_DFL
SIG_ERR
SIGHUP
SIGINT
SIGQUIT
SIGILL
SIGTRAP
SIGABRT
SIGIOT
SIGBUS
SIGFPE
SIGKILL
SIGUSR1
SIGSEGV
SIGUSR2
SIGPIPE
SIGALRM
SIGTERM
SIGSTKFLT
SIGCLD
SIGCHLD
SIGCONT
SIGSTOP
SIGTSTP
SIGTTIN
SIGTTOU
SIGURG
SIGXCPU
SIGXFSZ
SIGVTALRM
SIGPROF
SIGWINCH
SIGPOLL
SIGPWR
SIGSYS
SIGBABY
PRIO_PGRP
PRIO_USER
PRIO_PROCESS
pcntl_fork
pcntl_waitpid
pcntl_wait
pcntl_signal
pcntl_wifexited
pcntl_wifstopped
pcntl_wifsignaled
pcntl_wexitstatus
pcntl_wtermsig
pcntl_wstopsig
pcntl_exec
pcntl_alarm
pcntl_getpriority
pcntl_setpriority
Error %d: No process was located using the given parameters
Error %d: Invalid identifier flag
Error %d: A process was located, but neither its effective nor real user ID matched the effective user ID of the caller
Error %d: Only a super user may attempt to increase the process priority
Invalid value for handle argument specified
%s is not a callable function name error
Error has occured: (errno %d) %s
%s is not callable
line_buffer
pending_input
prompt
terminal_name
library_version
readline_name
readline
readline_info
readline_add_history
readline_clear_history
readline_list_history
readline_read_history
readline_write_history
readline_completion_function
readline_callback_read_char
readline_redisplay
readline_on_new_line
readline_callback_handler_install
readline_callback_handler_remove
SCRIPT_NAME
SCRIPT_FILENAME
PATH_TRANSLATED
DOCUMENT_ROOT
php://stdin
php://stdout
php://stderr
[PHP Modules]
[Zend Modules]
16:48:28
Dec 18 2013
You can use -f only once.
You can use -r only once.
You can use -B only once.
You can use -E only once.
Interactive shell
Could not startup.
php > 
~/.php_history
php shell code
Errors parsing %s
Command line code
Command line begin code
Command line run code
Command line end code
Exception: %s
Extension '%s' not present.
Command Line Interface
interactive
process-begin
no-chdir
process-end
profile-info
process-file
syntax-check
no-php-ini
no-header
process-code
hide-args
syntax-highlight
syntax-highlighting
zend-extension
rfunction
rclass
rextension
rextinfo
Could not open input file: %s
html_errors=0
register_argc_argv=1
implicit_flush=1
output_buffering=0
max_execution_time=0
max_input_time=-1
Usage: %s [options] [-f] <file> [--] [args...]
       %s [options] -r <code> [--] [args...]
       %s [options] [-B <begin_code>] -R <code> [-E <end_code>] [--] [args...]
       %s [options] [-B <begin_code>] -F <file> [-E <end_code>] [--] [args...]
       %s [options] -- [args...]
       %s [options] -a
  -a               Run as interactive shell
  -c <path>|<file> Look for php.ini file in this directory
  -n               No php.ini file will be used
  -d foo[=bar]     Define INI entry foo with value 'bar'
  -e               Generate extended information for debugger/profiler
  -f <file>        Parse and execute <file>.
  -h               This help
  -i               PHP information
  -l               Syntax check only (lint)
  -m               Show compiled in modules
  -r <code>        Run PHP <code> without using script tags <?..?>
  -B <begin_code>  Run PHP <begin_code> before processing input lines
  -R <code>        Run PHP <code> for every input line
  -F <file>        Parse and execute <file> for every input line
  -E <end_code>    Run PHP <end_code> after processing all input lines
  -H               Hide any passed arguments from external tools.
  -s               Output HTML syntax highlighted source.
  -v               Version number
  -w               Output source with stripped comments and whitespace.
  -z <file>        Load Zend extension <file>.
  args...          Arguments passed to script. Use -- args when first argument
                   starts with - or script is read from stdin
  --ini            Show configuration file names
  --rf <name>      Show information about function <name>.
  --rc <name>      Show information about class <name>.
  --re <name>      Show information about extension <name>.
  --ri <name>      Show configuration for extension <name>.
PHP %s (%s) (built: %s %s) %s
Copyright (c) 1997-2010 The PHP Group
You can use -R or -F only once.
Source highlighting only works for files.
Source stripping only works for files.
No syntax errors detected in %s
Configuration File (php.ini) Path: %s
Loaded Configuration File:         %s
Scan for additional .ini files in: %s
Additional .ini files parsed:      %s
Either execute direct code, process stdin or use a file.
php ( 
php { 
php ' 
php " 
/*  > 
<<< > 
    > 
%s::%s
Error in argument %d, char %d: 
: in flags
option not found %c
no argument for option %c
unknown
UCS-4LE
0123456789abcdef
0123456789ABCDEF
Photoshop 3.0
abcdefghijklmnopqrstuvwxyzABCDEFGHIJKLMNOPQRSTUVWXYZ
nopqrstuvwxyzabcdefghijklmNOPQRSTUVWXYZABCDEFGHIJKLM
ABCDEFGHIJKLMNOPQRSTUVWXYZ
abcdefghijklmnopqrstuvwxyz
abcdefghijklmnopqrstuvwxyzABCDEFGHIJKLMNOPQRSTUVWXYZ
nopqrstuvwxyzabcdefghijklmNOPQRSTUVWXYZABCDEFGHIJKLM
0123456789ABCDEF
0123456789abcdef
 !"#$%&'()*+,-./0123456789:;<=>?@ABCDEFGHIJKLMNOPQRSTUVWXYZ[\]^_`abcdefghijklmnopqrstuvwxyz{|}~
php.debug
.shstrtab
.interp
.note.ABI-tag
.gnu.hash
.dynsym
.dynstr
.gnu.version
.gnu.version_r
.rel.dyn
.rel.plt
.rodata
.eh_frame_hdr
.eh_frame
.ctors
.dtors
.data.rel.ro
.dynamic
.got.plt
.gnu_debuglink